BDBM205765 US9255090, 234
SMILES: CCOc1cc(CC(O)=O)ccc1-c1ccc(F)c2CCN(Cc12)C(=O)C[C@@H](C)c1ccccc1
InChI Key: InChIKey=WWKIJNCDUVPBAY-LJQANCHMSA-N
Data: 1 IC50
Activity Spreadsheet -- Enzyme Inhibition Constant Data from BindingDB
Found 1 hit for monomerid = 205765
Trg + Lig
Ki
nM
ΔG°
kcal/mole
IC50
nM
Kd
nM
EC50/IC50
nM
koff
s-1
kon
M-1s-1
pHTemp
°C
G protein-coupled receptor 44
(Homo sapiens (Human))
BDBM205765
(US9255090, 234)
Show SMILES CCOc1cc(CC(O)=O)ccc1-c1ccc(F)c2CCN(Cc12)C(=O)C[C@@H](C)c1ccccc1
Show InChI InChI=1S/C29H30FNO4/c1-3-35-27-16-20(17-29(33)34)9-10-24(27)22-11-12-26(30)23-13-14-31(18-25(22)23)28(32)15-19(2)21-7-5-4-6-8-21/h4-12,16,19H,3,13-15,17-18H2,1-2H3,(H,33,34)/t19-/m1/s1
Reactome pathway
US Patent
n/an/a 0.900n/an/an/an/a7.025
ACTELION PHARMACEUTICALS LTD.
US Patent
Assay Description
Binding assay was performed in a final assay volume of 250 ul. First, 25 ul of test compound, previously diluted in Binding-Buffer (Binding-Buffer: 5...
US Patent US9255090 (2016)
BindingDB Entry DOI: 10.7270/Q2TQ60B2