null
SMILES: C[C@H](N1CCN(CC1)c1cc(Oc2cccc3sc(NC(C)=O)nc23)ncn1)c1ccc(F)cc1
InChI Key: InChIKey=QUHZTEMPQQZPNB-INIZCTEOSA-N
Activity Spreadsheet -- Enzyme Inhibition Constant Data from BindingDB
Found 2 hits for monomerid = 20582
Trg + Lig
Ki
nM
ΔG°
kcal/mole
IC50
nM
Kd
nM
EC50/IC50
nM
koff
s-1
kon
M-1s-1
pHTemp
°C
Transient receptor potential cation channel subfamily V member 1
(Rattus norvegicus (rat))
BDBM20582
(N-{4-[(6-{4-[(1S)-1-(4-fluorophenyl)ethyl]piperazi...)
Show SMILES C[C@H](N1CCN(CC1)c1cc(Oc2cccc3sc(NC(C)=O)nc23)ncn1)c1ccc(F)cc1 |r|
Show InChI InChI=1S/C25H25FN6O2S/c1-16(18-6-8-19(26)9-7-18)31-10-12-32(13-11-31)22-14-23(28-15-27-22)34-20-4-3-5-21-24(20)30-25(35-21)29-17(2)33/h3-9,14-16H,10-13H2,1-2H3,(H,29,30,33)/t16-/m0/s1
Reactome pathway
n/an/a 5n/an/an/an/an/an/a
Amgen
Assay Description
TRPV1 activities were monitored as a function of cellular uptake of radioactive calcium (45Ca2+). The test compounds were preincubated with TRPV1 exp...
J Med Chem 50: 3528-39 (2007)
Article DOI: 10.1021/jm070191h
BindingDB Entry DOI: 10.7270/Q2MW2FF4
Transient receptor potential cation channel subfamily V member 1
(Rattus norvegicus (rat))
BDBM20582
(N-{4-[(6-{4-[(1S)-1-(4-fluorophenyl)ethyl]piperazi...)
Show SMILES C[C@H](N1CCN(CC1)c1cc(Oc2cccc3sc(NC(C)=O)nc23)ncn1)c1ccc(F)cc1 |r|
Show InChI InChI=1S/C25H25FN6O2S/c1-16(18-6-8-19(26)9-7-18)31-10-12-32(13-11-31)22-14-23(28-15-27-22)34-20-4-3-5-21-24(20)30-25(35-21)29-17(2)33/h3-9,14-16H,10-13H2,1-2H3,(H,29,30,33)/t16-/m0/s1
Reactome pathway
n/an/a 7n/an/an/an/a7.422
Amgen
Assay Description
TRPV1 activities were monitored as a function of cellular uptake of radioactive calcium (45Ca2+). The test compounds were preincubated with TRPV1 exp...
J Med Chem 50: 3528-39 (2007)
Article DOI: 10.1021/jm070191h
BindingDB Entry DOI: 10.7270/Q2MW2FF4