BDBM205866 US9255090, 335
SMILES: CCOc1ccc(CC(O)=O)cc1-c1ccc(F)c2CCN(Cc12)C(=O)CC1CCOc2cc(F)ccc12
InChI Key: InChIKey=XNROFBBNYUPOSP-UHFFFAOYSA-N
Data: 1 IC50
Activity Spreadsheet -- Enzyme Inhibition Constant Data from BindingDB
Found 1 hit for monomerid = 205866
Trg + Lig
Ki
nM
ΔG°
kcal/mole
IC50
nM
Kd
nM
EC50/IC50
nM
koff
s-1
kon
M-1s-1
pHTemp
°C
G protein-coupled receptor 44
(Homo sapiens (Human))
BDBM205866
(US9255090, 335)
Show SMILES CCOc1ccc(CC(O)=O)cc1-c1ccc(F)c2CCN(Cc12)C(=O)CC1CCOc2cc(F)ccc12
Show InChI InChI=1S/C30H29F2NO5/c1-2-37-27-8-3-18(14-30(35)36)13-24(27)22-6-7-26(32)23-9-11-33(17-25(22)23)29(34)15-19-10-12-38-28-16-20(31)4-5-21(19)28/h3-8,13,16,19H,2,9-12,14-15,17H2,1H3,(H,35,36)
Reactome pathway
US Patent
n/an/a 0.900n/an/an/an/a7.025
ACTELION PHARMACEUTICALS LTD.
US Patent
Assay Description
Binding assay was performed in a final assay volume of 250 ul. First, 25 ul of test compound, previously diluted in Binding-Buffer (Binding-Buffer: 5...
US Patent US9255090 (2016)
BindingDB Entry DOI: 10.7270/Q2TQ60B2