BDBM205880 US9255090, 349
SMILES: CCOc1cc(CC(O)=O)ccc1-c1ccc(F)c2CCN(Cc12)C(=O)CCc1ccccn1
InChI Key: InChIKey=QKHJGKPKWOELML-UHFFFAOYSA-N
Data: 1 IC50
Activity Spreadsheet -- Enzyme Inhibition Constant Data from BindingDB
Found 1 hit for monomerid = 205880
Trg + Lig
Ki
nM
ΔG°
kcal/mole
IC50
nM
Kd
nM
EC50/IC50
nM
koff
s-1
kon
M-1s-1
pHTemp
°C
G protein-coupled receptor 44
(Homo sapiens (Human))
BDBM205880
(US9255090, 349)
Show SMILES CCOc1cc(CC(O)=O)ccc1-c1ccc(F)c2CCN(Cc12)C(=O)CCc1ccccn1
Show InChI InChI=1S/C27H27FN2O4/c1-2-34-25-15-18(16-27(32)33)6-8-22(25)20-9-10-24(28)21-12-14-30(17-23(20)21)26(31)11-7-19-5-3-4-13-29-19/h3-6,8-10,13,15H,2,7,11-12,14,16-17H2,1H3,(H,32,33)
Reactome pathway
US Patent
n/an/a 0.5n/an/an/an/a7.025
ACTELION PHARMACEUTICALS LTD.
US Patent
Assay Description
Binding assay was performed in a final assay volume of 250 ul. First, 25 ul of test compound, previously diluted in Binding-Buffer (Binding-Buffer: 5...
US Patent US9255090 (2016)
BindingDB Entry DOI: 10.7270/Q2TQ60B2