BDBM206086 US9255107, 6
SMILES: CN(C)c1nc2cc(ccn2n1)C#Cc1cc(ccc1C)C(=O)Nc1ccc(CN2CCN(C)CC2)c(c1)C(F)(F)F
InChI Key: InChIKey=HPHCSGXKMGGGEX-UHFFFAOYSA-N
Data: 1 IC50
Activity Spreadsheet -- Enzyme Inhibition Constant Data from BindingDB
Found 1 hit for monomerid = 206086
Trg + Lig
Ki
nM
ΔG°
kcal/mole
IC50
nM
Kd
nM
EC50/IC50
nM
koff
s-1
kon
M-1s-1
pHTemp
°C
ABL Mutant (T315I)
(Homo sapiens (Human))
BDBM206086
(US9255107, 6)
Show SMILES CN(C)c1nc2cc(ccn2n1)C#Cc1cc(ccc1C)C(=O)Nc1ccc(CN2CCN(C)CC2)c(c1)C(F)(F)F
Show InChI InChI=1S/C31H32F3N7O/c1-21-5-7-24(18-23(21)8-6-22-11-12-41-28(17-22)36-30(37-41)38(2)3)29(42)35-26-10-9-25(27(19-26)31(32,33)34)20-40-15-13-39(4)14-16-40/h5,7,9-12,17-19H,13-16,20H2,1-4H3,(H,35,42)
US Patent
n/an/a 39.4n/an/an/an/an/a25
NANJING SANHOME PHARMACEUTICAL CO., LTD.
US Patent
Assay Description
Serially diluting the compound of the present invention from 1 uM initial concentration in three-fold fashion and formulating 10 concentrations (50.8...
US Patent US9255107 (2016)
BindingDB Entry DOI: 10.7270/Q22806F9