null
SMILES: Cn1cc(cc(Nc2cccc(OCCNC(=O)C=C)n2)c1=O)-c1ccnc(c1CO)-n1ncc2cc(cc(F)c2c1=O)C(C)(C)C
InChI Key: InChIKey=YBLAXCCNUULUKE-UHFFFAOYSA-N
Activity Spreadsheet -- Enzyme Inhibition Constant Data from BindingDB
Found 1 hit for monomerid = 206353
Trg + Lig
Ki
nM
ΔG°
kcal/mole
IC50
nM
Kd
nM
EC50/IC50
nM
koff
s-1
kon
M-1s-1
pHTemp
°C
Tyrosine-protein kinase BTK
(Homo sapiens (Human))
BDBM206353
(US9260415, 104)
Show SMILES Cn1cc(cc(Nc2cccc(OCCNC(=O)C=C)n2)c1=O)-c1ccnc(c1CO)-n1ncc2cc(cc(F)c2c1=O)C(C)(C)C
Show InChI InChI=1S/C34H34FN7O5/c1-6-28(44)36-12-13-47-29-9-7-8-27(40-29)39-26-15-21(18-41(5)32(26)45)23-10-11-37-31(24(23)19-43)42-33(46)30-20(17-38-42)14-22(16-25(30)35)34(2,3)4/h6-11,14-18,43H,1,12-13,19H2,2-5H3,(H,36,44)(H,39,40)
NCI pathway
Reactome pathway
US Patent
0.915n/an/an/an/an/an/a7.5n/a
Genentech, Inc.
US Patent
Assay Description
A generalized procedure for a standard biochemical Btk, Kinase Assay that can be used to test Formula I compounds is as follows. A master mix minus B...
US Patent US9260415 (2016)
BindingDB Entry DOI: 10.7270/Q2WH2NT7