BDBM206355 US9260415, 106
SMILES: CC#CC(=O)NCCOc1cccc(Nc2cc(cn(C)c2=O)-c2cc(F)cc(c2CO)-n2ncc3c4CCCCc4sc3c2=O)n1
InChI Key: InChIKey=XPQAHVKNSSZOHK-UHFFFAOYSA-N
Data: 1 KI
Activity Spreadsheet -- Enzyme Inhibition Constant Data from BindingDB
Found 1 hit for monomerid = 206355
Trg + Lig
Ki
nM
ΔG°
kcal/mole
IC50
nM
Kd
nM
EC50/IC50
nM
koff
s-1
kon
M-1s-1
pHTemp
°C
Tyrosine-protein kinase BTK
(Homo sapiens (Human))
BDBM206355
(US9260415, 106)
Show SMILES CC#CC(=O)NCCOc1cccc(Nc2cc(cn(C)c2=O)-c2cc(F)cc(c2CO)-n2ncc3c4CCCCc4sc3c2=O)n1
Show InChI InChI=1S/C34H31FN6O5S/c1-3-7-30(43)36-12-13-46-31-11-6-10-29(39-31)38-26-14-20(18-40(2)33(26)44)23-15-21(35)16-27(25(23)19-42)41-34(45)32-24(17-37-41)22-8-4-5-9-28(22)47-32/h6,10-11,14-18,42H,4-5,8-9,12-13,19H2,1-2H3,(H,36,43)(H,38,39)
NCI pathway
Reactome pathway
US Patent
0.306n/an/an/an/an/an/a7.5n/a
Genentech, Inc.
US Patent
Assay Description
A generalized procedure for a standard biochemical Btk, Kinase Assay that can be used to test Formula I compounds is as follows. A master mix minus B...
US Patent US9260415 (2016)
BindingDB Entry DOI: 10.7270/Q2WH2NT7