BDBM206362 US9260415, 113
SMILES: CN(CCOc1cccc(Nc2cc(cn(C)c2=O)-c2cc(F)cc(c2CO)-n2ncc3c4CCCCc4sc3c2=O)n1)C(=O)C=C
InChI Key: InChIKey=OZKPFYTYTIVSCG-UHFFFAOYSA-N
Data: 1 KI
Activity Spreadsheet -- Enzyme Inhibition Constant Data from BindingDB
Found 1 hit for monomerid = 206362
Trg + Lig
Ki
nM
ΔG°
kcal/mole
IC50
nM
Kd
nM
EC50/IC50
nM
koff
s-1
kon
M-1s-1
pHTemp
°C
Tyrosine-protein kinase BTK
(Homo sapiens (Human))
BDBM206362
(US9260415, 113)
Show SMILES CN(CCOc1cccc(Nc2cc(cn(C)c2=O)-c2cc(F)cc(c2CO)-n2ncc3c4CCCCc4sc3c2=O)n1)C(=O)C=C
Show InChI InChI=1S/C34H33FN6O5S/c1-4-31(43)39(2)12-13-46-30-11-7-10-29(38-30)37-26-14-20(18-40(3)33(26)44)23-15-21(35)16-27(25(23)19-42)41-34(45)32-24(17-36-41)22-8-5-6-9-28(22)47-32/h4,7,10-11,14-18,42H,1,5-6,8-9,12-13,19H2,2-3H3,(H,37,38)
NCI pathway
Reactome pathway
US Patent
0.146n/an/an/an/an/an/a7.5n/a
Genentech, Inc.
US Patent
Assay Description
A generalized procedure for a standard biochemical Btk, Kinase Assay that can be used to test Formula I compounds is as follows. A master mix minus B...
US Patent US9260415 (2016)
BindingDB Entry DOI: 10.7270/Q2WH2NT7