BDBM206365 US9260415, 116
SMILES: CC#CC(=O)NCCOc1cccc(Nc2cc(cn(C)c2=O)-c2ccnc(N3CCn4c5CC(C)(C)Cc5cc4C3=O)c2CO)n1
InChI Key: InChIKey=OKDLTBPVJKLWDS-UHFFFAOYSA-N
Data: 1 KI
Activity Spreadsheet -- Enzyme Inhibition Constant Data from BindingDB
Found 1 hit for monomerid = 206365
Trg + Lig
Ki
nM
ΔG°
kcal/mole
IC50
nM
Kd
nM
EC50/IC50
nM
koff
s-1
kon
M-1s-1
pHTemp
°C
Tyrosine-protein kinase BTK
(Homo sapiens (Human))
BDBM206365
(US9260415, 116)
Show SMILES CC#CC(=O)NCCOc1cccc(Nc2cc(cn(C)c2=O)-c2ccnc(N3CCn4c5CC(C)(C)Cc5cc4C3=O)c2CO)n1
Show InChI InChI=1S/C35H37N7O5/c1-5-7-30(44)36-12-15-47-31-9-6-8-29(39-31)38-26-16-23(20-40(4)33(26)45)24-10-11-37-32(25(24)21-43)42-14-13-41-27(34(42)46)17-22-18-35(2,3)19-28(22)41/h6,8-11,16-17,20,43H,12-15,18-19,21H2,1-4H3,(H,36,44)(H,38,39)
NCI pathway
Reactome pathway
US Patent
2.37n/an/an/an/an/an/a7.5n/a
Genentech, Inc.
US Patent
Assay Description
A generalized procedure for a standard biochemical Btk, Kinase Assay that can be used to test Formula I compounds is as follows. A master mix minus B...
US Patent US9260415 (2016)
BindingDB Entry DOI: 10.7270/Q2WH2NT7