BDBM206536 US9260425, 289
SMILES: N[C@H]1CCCN(C1)c1nc(ccc1Br)-c1n[nH]c2cnc(cc12)-c1cccnc1
InChI Key:
Data: 1 KI
Activity Spreadsheet -- Enzyme Inhibition Constant Data from BindingDB
Found 1 hit for monomerid = 206536
Trg + Lig
Ki
nM
ΔG°
kcal/mole
IC50
nM
Kd
nM
EC50/IC50
nM
koff
s-1
kon
M-1s-1
pHTemp
°C
Serine/threonine-protein kinase pim-1
(Homo sapiens (Human))
BDBM206536
(US9260425, 289)
Show SMILES N[C@H]1CCCN(C1)c1nc(ccc1Br)-c1n[nH]c2cnc(cc12)-c1cccnc1 |r|
US Patent
0.0170n/an/an/an/an/an/a7.2n/a
Genetech, Inc.
US Patent
Assay Description
PIM-1, PIM-2, and PIM-3 enzymes were generated as fusion proteins expressed in bacteria and purified by IMAC column chromatography (Sun, X., Chiu, J....
US Patent US9260425 (2016)
BindingDB Entry DOI: 10.7270/Q2RR1X3X