BDBM20655 N-benzyl-4-{[5-(methoxycarbamoyl)-2-methylphenyl]amino}-5-methylpyrrolo[1,2-a][1,2,4]triazine-6-carboxamide::pyrrolo[2,1-f][1,2,4]triazine analogue, 11h
SMILES: CONC(=O)c1ccc(C)c(Nc2ncnn3cc(C(=O)NCc4ccccc4)c(C)c23)c1
InChI Key: InChIKey=LOVKXHMIRFCDPP-UHFFFAOYSA-N
Data: 1 IC50  1 EC50
PDB links: 1 PDB ID contains this monomer as substructures. 1 PDB ID contains inhibitors having a similarity of 90% to this monomer.
Activity Spreadsheet -- Enzyme Inhibition Constant Data from BindingDB
Found 1 hit for monomerid = 20655
Trg + Lig
Ki
nM
ΔG°
kcal/mole
IC50
nM
Kd
nM
EC50/IC50
nM
koff
s-1
kon
M-1s-1
pHTemp
°C
Mitogen-activated protein kinase 14
(Homo sapiens (Human))
BDBM20655
(N-benzyl-4-{[5-(methoxycarbamoyl)-2-methylphenyl]a...)
Show SMILES CONC(=O)c1ccc(C)c(Nc2ncnn3cc(C(=O)NCc4ccccc4)c(C)c23)c1
Show InChI InChI=1S/C24H24N6O3/c1-15-9-10-18(23(31)29-33-3)11-20(15)28-22-21-16(2)19(13-30(21)27-14-26-22)24(32)25-12-17-7-5-4-6-8-17/h4-11,13-14H,12H2,1-3H3,(H,25,32)(H,29,31)(H,26,27,28)
NCI pathway
Reactome pathway
n/an/a 0.400n/a 9.60n/an/a7.522
Novartis Pharmaceuticals
Assay Description
The kinase activity was determined by quantitation of the amount of radioactive phosphate transferred to myelin basic protein (MBP) with or without i...
J Med Chem 51: 4-16 (2008)
Article DOI: 10.1021/jm7009414
BindingDB Entry DOI: 10.7270/Q23T9FHB