BDBM20660 3-({6-acetamido-5-methylpyrrolo[1,2-a][1,2,4]triazin-4-yl}amino)-N-methoxy-4-methylbenzamide::pyrrolo[2,1-f][1,2,4]triazine analogue, 15a
SMILES: CONC(=O)c1ccc(C)c(Nc2ncnn3cc(NC(C)=O)c(C)c23)c1
InChI Key: InChIKey=FOOJQJQBMWRTIZ-UHFFFAOYSA-N
Data: 1 IC50  1 EC50
Activity Spreadsheet -- Enzyme Inhibition Constant Data from BindingDB
Found 1 hit for monomerid = 20660
Trg + Lig
Ki
nM
ΔG°
kcal/mole
IC50
nM
Kd
nM
EC50/IC50
nM
koff
s-1
kon
M-1s-1
pHTemp
°C
Mitogen-activated protein kinase 14
(Homo sapiens (Human))
BDBM20660
(3-({6-acetamido-5-methylpyrrolo[1,2-a][1,2,4]triaz...)
Show SMILES CONC(=O)c1ccc(C)c(Nc2ncnn3cc(NC(C)=O)c(C)c23)c1
Show InChI InChI=1S/C18H20N6O3/c1-10-5-6-13(18(26)23-27-4)7-14(10)22-17-16-11(2)15(21-12(3)25)8-24(16)20-9-19-17/h5-9H,1-4H3,(H,21,25)(H,23,26)(H,19,20,22)
NCI pathway
Reactome pathway
n/an/a 3.60n/a 190n/an/a7.522
Novartis Pharmaceuticals
Assay Description
The kinase activity was determined by quantitation of the amount of radioactive phosphate transferred to myelin basic protein (MBP) with or without i...
J Med Chem 51: 4-16 (2008)
Article DOI: 10.1021/jm7009414
BindingDB Entry DOI: 10.7270/Q23T9FHB