BDBM20668 ethyl N-(4-methyl-3-{[5-methyl-6-(propylcarbamoyl)pyrrolo[1,2-a][1,2,4]triazin-4-yl]amino}phenyl)carbamate::pyrrolo[2,1-f][1,2,4]triazine analogue, 21b
SMILES: CCCNC(=O)c1cn2ncnc(Nc3cc(NC(=O)OCC)ccc3C)c2c1C
InChI Key: InChIKey=MHSSSOPSKCOGJV-UHFFFAOYSA-N
Data: 1 IC50  1 EC50
Activity Spreadsheet -- Enzyme Inhibition Constant Data from BindingDB
Found 1 hit for monomerid = 20668
Trg + Lig
Ki
nM
ΔG°
kcal/mole
IC50
nM
Kd
nM
EC50/IC50
nM
koff
s-1
kon
M-1s-1
pHTemp
°C
Mitogen-activated protein kinase 14
(Homo sapiens (Human))
BDBM20668
(ethyl N-(4-methyl-3-{[5-methyl-6-(propylcarbamoyl)...)
Show SMILES CCCNC(=O)c1cn2ncnc(Nc3cc(NC(=O)OCC)ccc3C)c2c1C
Show InChI InChI=1S/C21H26N6O3/c1-5-9-22-20(28)16-11-27-18(14(16)4)19(23-12-24-27)26-17-10-15(8-7-13(17)3)25-21(29)30-6-2/h7-8,10-12H,5-6,9H2,1-4H3,(H,22,28)(H,25,29)(H,23,24,26)
NCI pathway
Reactome pathway
n/an/a 5.5n/a 69n/an/a7.522
Novartis Pharmaceuticals
Assay Description
The kinase activity was determined by quantitation of the amount of radioactive phosphate transferred to myelin basic protein (MBP) with or without i...
J Med Chem 51: 4-16 (2008)
Article DOI: 10.1021/jm7009414
BindingDB Entry DOI: 10.7270/Q23T9FHB