BDBM206727 US9260425, 489
SMILES: FCCn1cc(cn1)-c1cc2c(n[nH]c2cn1)-c1cccc(n1)N1CCCNCC1
InChI Key: InChIKey=DLZIZKARHRLIHL-UHFFFAOYSA-N
Data: 1 KI
Activity Spreadsheet -- Enzyme Inhibition Constant Data from BindingDB
Found 1 hit for monomerid = 206727
Trg + Lig
Ki
nM
ΔG°
kcal/mole
IC50
nM
Kd
nM
EC50/IC50
nM
koff
s-1
kon
M-1s-1
pHTemp
°C
Serine/threonine-protein kinase pim-1
(Homo sapiens (Human))
BDBM206727
(US9260425, 489)
Show SMILES FCCn1cc(cn1)-c1cc2c(n[nH]c2cn1)-c1cccc(n1)N1CCCNCC1
Show InChI InChI=1S/C21H23FN8/c22-5-9-30-14-15(12-25-30)18-11-16-19(13-24-18)27-28-21(16)17-3-1-4-20(26-17)29-8-2-6-23-7-10-29/h1,3-4,11-14,23H,2,5-10H2,(H,27,28)
US Patent
0.0140n/an/an/an/an/an/a7.2n/a
Genetech, Inc.
US Patent
Assay Description
PIM-1, PIM-2, and PIM-3 enzymes were generated as fusion proteins expressed in bacteria and purified by IMAC column chromatography (Sun, X., Chiu, J....
US Patent US9260425 (2016)
BindingDB Entry DOI: 10.7270/Q2RR1X3X