BDBM20686 2-amino-5-[(3,5-dibromophenyl)methyl]-6-methyl-3H,4H,5H-pyrrolo[3,2-d]pyrimidin-4-one::Pyrrolo[3,2-d]pyrimidine analogue, 14
SMILES: Cc1cc2nc(N)[nH]c(=O)c2n1Cc1cc(Br)cc(Br)c1
InChI Key: InChIKey=GJPQXCRNUUHPBJ-UHFFFAOYSA-N
Data: 6 IC50
Activity Spreadsheet -- Enzyme Inhibition Constant Data from BindingDB
Found 6 hits for monomerid = 20686
Trg + Lig
Ki
nM
ΔG°
kcal/mole
IC50
nM
Kd
nM
EC50/IC50
nM
koff
s-1
kon
M-1s-1
pHTemp
°C
Thymidylate Synthase (TS)
(Escherichia coli)
BDBM20686
(2-amino-5-[(3,5-dibromophenyl)methyl]-6-methyl-3H,...)
Show SMILES Cc1cc2nc(N)[nH]c(=O)c2n1Cc1cc(Br)cc(Br)c1
Show InChI InChI=1S/C14H12Br2N4O/c1-7-2-11-12(13(21)19-14(17)18-11)20(7)6-8-3-9(15)5-10(16)4-8/h2-5H,6H2,1H3,(H3,17,18,19,21)
n/an/a>2.00E+4n/an/an/an/an/an/a
Duquesne University
Assay Description
TS was assayed spectrophotometrically in the reaction buffer solution containing (6R, 6S)-5, 10-CH2H4folate. The reaction was initiated by the additi...
J Med Chem 51: 68-76 (2008)
Article DOI: 10.1021/jm701052u
BindingDB Entry DOI: 10.7270/Q2057D6N
Dihydrofolate reductase (DHFR)
(Toxoplasma gondii)
BDBM20686
(2-amino-5-[(3,5-dibromophenyl)methyl]-6-methyl-3H,...)
Show SMILES Cc1cc2nc(N)[nH]c(=O)c2n1Cc1cc(Br)cc(Br)c1
Show InChI InChI=1S/C14H12Br2N4O/c1-7-2-11-12(13(21)19-14(17)18-11)20(7)6-8-3-9(15)5-10(16)4-8/h2-5H,6H2,1H3,(H3,17,18,19,21)
n/an/a>2.00E+4n/an/an/an/an/an/a
Duquesne University
Assay Description
TS was assayed spectrophotometrically in the reaction buffer solution containing (6R, 6S)-5, 10-CH2H4folate. The reaction was initiated by the additi...
J Med Chem 51: 68-76 (2008)
Article DOI: 10.1021/jm701052u
BindingDB Entry DOI: 10.7270/Q2057D6N
Thymidylate synthase
(Homo sapiens (Human))
BDBM20686
(2-amino-5-[(3,5-dibromophenyl)methyl]-6-methyl-3H,...)
Show SMILES Cc1cc2nc(N)[nH]c(=O)c2n1Cc1cc(Br)cc(Br)c1
Show InChI InChI=1S/C14H12Br2N4O/c1-7-2-11-12(13(21)19-14(17)18-11)20(7)6-8-3-9(15)5-10(16)4-8/h2-5H,6H2,1H3,(H3,17,18,19,21)
NCI pathway
Reactome pathway
n/an/a 1.00E+4n/an/an/an/a7.430
Duquesne University
Assay Description
TS was assayed spectrophotometrically in the reaction buffer solution containing (6R, 6S)-5, 10-CH2H4folate. The reaction was initiated by the additi...
J Med Chem 51: 68-76 (2008)
Article DOI: 10.1021/jm701052u
BindingDB Entry DOI: 10.7270/Q2057D6N
Dihydrofolate Reductase (DHFR)
(Escherichia coli)
BDBM20686
(2-amino-5-[(3,5-dibromophenyl)methyl]-6-methyl-3H,...)
Show SMILES Cc1cc2nc(N)[nH]c(=O)c2n1Cc1cc(Br)cc(Br)c1
Show InChI InChI=1S/C14H12Br2N4O/c1-7-2-11-12(13(21)19-14(17)18-11)20(7)6-8-3-9(15)5-10(16)4-8/h2-5H,6H2,1H3,(H3,17,18,19,21)
n/an/a>2.40E+4n/an/an/an/an/an/a
Duquesne University
Assay Description
DHFRs were assayed spectrophotometrically in the reaction buffer solution containing dihydrofolate. The reaction was initiated with an amount of enzy...
J Med Chem 51: 68-76 (2008)
Article DOI: 10.1021/jm701052u
BindingDB Entry DOI: 10.7270/Q2057D6N
Dihydrofolate reductase (DHFR)
(Toxoplasma gondii)
BDBM20686
(2-amino-5-[(3,5-dibromophenyl)methyl]-6-methyl-3H,...)
Show SMILES Cc1cc2nc(N)[nH]c(=O)c2n1Cc1cc(Br)cc(Br)c1
Show InChI InChI=1S/C14H12Br2N4O/c1-7-2-11-12(13(21)19-14(17)18-11)20(7)6-8-3-9(15)5-10(16)4-8/h2-5H,6H2,1H3,(H3,17,18,19,21)
n/an/a 2.40E+4n/an/an/an/an/an/a
Duquesne University
Assay Description
DHFRs were assayed spectrophotometrically in the reaction buffer solution containing dihydrofolate. The reaction was initiated with an amount of enzy...
J Med Chem 51: 68-76 (2008)
Article DOI: 10.1021/jm701052u
BindingDB Entry DOI: 10.7270/Q2057D6N
Dihydrofolate reductase
(Homo sapiens (Human))
BDBM20686
(2-amino-5-[(3,5-dibromophenyl)methyl]-6-methyl-3H,...)
Show SMILES Cc1cc2nc(N)[nH]c(=O)c2n1Cc1cc(Br)cc(Br)c1
Show InChI InChI=1S/C14H12Br2N4O/c1-7-2-11-12(13(21)19-14(17)18-11)20(7)6-8-3-9(15)5-10(16)4-8/h2-5H,6H2,1H3,(H3,17,18,19,21)
NCI pathway
Reactome pathway
n/an/a>2.40E+4n/an/an/an/an/an/a
Duquesne University
Assay Description
DHFRs were assayed spectrophotometrically in the reaction buffer solution containing dihydrofolate. The reaction was initiated with an amount of enzy...
J Med Chem 51: 68-76 (2008)
Article DOI: 10.1021/jm701052u
BindingDB Entry DOI: 10.7270/Q2057D6N