BDBM20695 pyrazole-based inhibitor, 38::sodium (3R,5R)-7-[3-({[4-(dimethylcarbamoyl)phenyl]methyl}carbamoyl)-1-(4-fluorophenyl)-4-(propan-2-yl)-1H-pyrazol-5-yl]-3,5-dihydroxyheptanoate
SMILES: CC(C)c1c(CC[C@@H](O)C[C@@H](O)CC([O-])=O)n(nc1C(=O)NCc1ccc(cc1)C(=O)N(C)C)-c1ccc(F)cc1
InChI Key: InChIKey=NRHMUVWUITXZFM-DNQXCXABSA-M
Data: 1 IC50  1 EC50
Activity Spreadsheet -- Enzyme Inhibition Constant Data from BindingDB
Found 1 hit for monomerid = 20695
Trg + Lig
Ki
nM
ΔG°
kcal/mole
IC50
nM
Kd
nM
EC50/IC50
nM
koff
s-1
kon
M-1s-1
pHTemp
°C
3-hydroxy-3-methylglutaryl-coenzyme A reductase
(Rattus norvegicus (rat))
BDBM20695
(pyrazole-based inhibitor, 38 | sodium (3R,5R)-7-[3...)
Show SMILES CC(C)c1c(CC[C@@H](O)C[C@@H](O)CC([O-])=O)n(nc1C(=O)NCc1ccc(cc1)C(=O)N(C)C)-c1ccc(F)cc1 |r|
Show InChI InChI=1S/C30H37FN4O6/c1-18(2)27-25(14-13-23(36)15-24(37)16-26(38)39)35(22-11-9-21(31)10-12-22)33-28(27)29(40)32-17-19-5-7-20(8-6-19)30(41)34(3)4/h5-12,18,23-24,36-37H,13-17H2,1-4H3,(H,32,40)(H,38,39)/p-1/t23-,24-/m1/s1
Reactome pathway
n/an/a 25n/a 23n/an/a7.237
Pfizer
Assay Description
Enzyme Assay for HMG-CoA reductase was based on the conversion of isotopically labeled HMG-CoA to mevalonic acid using rat liver microsomes as enzyme...
J Med Chem 51: 31-45 (2008)
Article DOI: 10.1021/jm070849r
BindingDB Entry DOI: 10.7270/Q2VD6WRD