BDBM20705 Tertiary Amide Analog, 47::sodium (3R,5R)-7-[1-(4-fluorophenyl)-3-{[(4-fluorophenyl)methyl](methyl)carbamoyl}-4-(propan-2-yl)-1H-pyrazol-5-yl]-3,5-dihydroxyheptanoate
SMILES: CC(C)c1c(CC[C@@H](O)C[C@@H](O)CC([O-])=O)n(nc1C(=O)N(C)Cc1ccc(F)cc1)-c1ccc(F)cc1
InChI Key: InChIKey=DBVKNXVHMHULLN-DHIUTWEWSA-M
Data: 1 IC50  1 EC50
Activity Spreadsheet -- Enzyme Inhibition Constant Data from BindingDB
Found 1 hit for monomerid = 20705
Trg + Lig
Ki
nM
ΔG°
kcal/mole
IC50
nM
Kd
nM
EC50/IC50
nM
koff
s-1
kon
M-1s-1
pHTemp
°C
HMG-CoA reductase
(Rattus norvegicus (rat))
BDBM20705
(Tertiary Amide Analog, 47 | sodium (3R,5R)-7-[1-(4...)
Show SMILES CC(C)c1c(CC[C@@H](O)C[C@@H](O)CC([O-])=O)n(nc1C(=O)N(C)Cc1ccc(F)cc1)-c1ccc(F)cc1 |r|
Show InChI InChI=1S/C28H33F2N3O5/c1-17(2)26-24(13-12-22(34)14-23(35)15-25(36)37)33(21-10-8-20(30)9-11-21)31-27(26)28(38)32(3)16-18-4-6-19(29)7-5-18/h4-11,17,22-23,34-35H,12-16H2,1-3H3,(H,36,37)/p-1/t22-,23-/m1/s1
Reactome pathway
n/an/a 6.60n/a 0.5n/an/a7.237
Pfizer
Assay Description
Enzyme Assay for HMG-CoA reductase was based on the conversion of isotopically labeled HMG-CoA to mevalonic acid using rat liver microsomes as enzyme...
J Med Chem 51: 31-45 (2008)
Article DOI: 10.1021/jm070849r
BindingDB Entry DOI: 10.7270/Q2VD6WRD