null
SMILES: CC(C)c1c(CC[C@@H](O)C[C@@H](O)CC([O-])=O)n(nc1C(=O)N(C)[C@@H](C)c1ccccc1)-c1ccc(F)cc1
InChI Key: InChIKey=MPDDTAJMJCESGV-WUMKDDEVSA-M
Activity Spreadsheet -- Enzyme Inhibition Constant Data from BindingDB
Found 1 hit for monomerid = 20709
Trg + Lig
Ki
nM
ΔG°
kcal/mole
IC50
nM
Kd
nM
EC50/IC50
nM
koff
s-1
kon
M-1s-1
pHTemp
°C
3-hydroxy-3-methylglutaryl-coenzyme A reductase
(Rattus norvegicus (rat))
BDBM20709
(Tertiary Amide Analog, 51 | sodium (3R,5R)-7-[1-(4...)
Show SMILES CC(C)c1c(CC[C@@H](O)C[C@@H](O)CC([O-])=O)n(nc1C(=O)N(C)[C@@H](C)c1ccccc1)-c1ccc(F)cc1 |r|
Show InChI InChI=1S/C29H36FN3O5/c1-18(2)27-25(15-14-23(34)16-24(35)17-26(36)37)33(22-12-10-21(30)11-13-22)31-28(27)29(38)32(4)19(3)20-8-6-5-7-9-20/h5-13,18-19,23-24,34-35H,14-17H2,1-4H3,(H,36,37)/p-1/t19-,23+,24+/m0/s1
Reactome pathway
n/an/a 45n/a 3.5n/an/a7.237
Pfizer
Assay Description
Enzyme Assay for HMG-CoA reductase was based on the conversion of isotopically labeled HMG-CoA to mevalonic acid using rat liver microsomes as enzyme...
J Med Chem 51: 31-45 (2008)
Article DOI: 10.1021/jm070849r
BindingDB Entry DOI: 10.7270/Q2VD6WRD