BDBM20733 4-(6-hydroxy-1,2-benzoxazol-3-yl)benzene-1,3-diol::Benzisoxazole, 14::CHEMBL360410
SMILES: Oc1ccc(-c2noc3cc(O)ccc23)c(O)c1
InChI Key: InChIKey=NBTXJDAHLMMIGY-UHFFFAOYSA-N
Data: 3 IC50
PDB links: 1 PDB ID matches this monomer.
Activity Spreadsheet -- Enzyme Inhibition Constant Data from BindingDB
Found 3 hits for monomerid = 20733
Trg + Lig
Ki
nM
ΔG°
kcal/mole
IC50
nM
Kd
nM
EC50/IC50
nM
koff
s-1
kon
M-1s-1
pHTemp
°C
Heat shock protein HSP 90-alpha
(Homo sapiens (Human))
BDBM20733
(4-(6-hydroxy-1,2-benzoxazol-3-yl)benzene-1,3-diol ...)
Show SMILES Oc1ccc(-c2noc3cc(O)ccc23)c(O)c1
Show InChI InChI=1S/C13H9NO4/c15-7-1-3-9(11(17)5-7)13-10-4-2-8(16)6-12(10)18-14-13/h1-6,15-17H
NCI pathway
Reactome pathway
n/an/a 1.52E+4n/an/an/an/a7.322
Wyeth Research
Assay Description
Compounds were assayed over a threefold dilution series in a 96-well plate format to determine IC50 values. The reaction was allowed to proceed with ...
J Med Chem 51: 373-5 (2008)
Article DOI: 10.1021/jm701385c
BindingDB Entry DOI: 10.7270/Q2G44NKB
Estrogen receptor
(Homo sapiens (Human))
BDBM20733
(4-(6-hydroxy-1,2-benzoxazol-3-yl)benzene-1,3-diol ...)
Show SMILES Oc1ccc(-c2noc3cc(O)ccc23)c(O)c1
Show InChI InChI=1S/C13H9NO4/c15-7-1-3-9(11(17)5-7)13-10-4-2-8(16)6-12(10)18-14-13/h1-6,15-17H
n/an/a 24n/an/an/an/an/an/a
Wyeth Research
Curated by ChEMBL
Assay Description
Inhibitory concentration against human ER alpha expressed in Escherichia coli was determined using [3H]17-beta-estradiol as radio ligand
J Med Chem 47: 5021-40 (2004)
Article DOI: 10.1021/jm049719y
BindingDB Entry DOI: 10.7270/Q2C828S5
Estradiol receptor beta (ERβ)
(Homo sapiens (Human))
BDBM20733
(4-(6-hydroxy-1,2-benzoxazol-3-yl)benzene-1,3-diol ...)
Show SMILES Oc1ccc(-c2noc3cc(O)ccc23)c(O)c1
Show InChI InChI=1S/C13H9NO4/c15-7-1-3-9(11(17)5-7)13-10-4-2-8(16)6-12(10)18-14-13/h1-6,15-17H
n/an/a 3.5n/an/an/an/an/an/a
Wyeth Research
Curated by ChEMBL
Assay Description
Inhibitory concentration against human ER beta expressed in Escherichia coli was determined using [3H]17-beta-estradiol as radio ligand
J Med Chem 47: 5021-40 (2004)
Article DOI: 10.1021/jm049719y
BindingDB Entry DOI: 10.7270/Q2C828S5
3D
3D Structure (crystal)