BDBM20755 9-butyl-8-[(5-chloro-1,3-benzothiazol-2-yl)sulfanyl]-9H-purin-6-amine::Benzothiazole analogue, 8
SMILES: CCCCn1c(Sc2nc3cc(Cl)ccc3s2)nc2c(N)ncnc12
InChI Key: InChIKey=BZVADQBAYRTMMX-UHFFFAOYSA-N
Data: 1 EC50
Activity Spreadsheet -- Enzyme Inhibition Constant Data from BindingDB
Found 1 hit for monomerid = 20755
Trg + Lig
Ki
nM
ΔG°
kcal/mole
IC50
nM
Kd
nM
EC50/IC50
nM
koff
s-1
kon
M-1s-1
pHTemp
°C
Heat shock protein HSP 90-beta
(Homo sapiens (Human))
BDBM20755
(9-butyl-8-[(5-chloro-1,3-benzothiazol-2-yl)sulfany...)
Show SMILES CCCCn1c(Sc2nc3cc(Cl)ccc3s2)nc2c(N)ncnc12
Show InChI InChI=1S/C16H15ClN6S2/c1-2-3-6-23-14-12(13(18)19-8-20-14)22-15(23)25-16-21-10-7-9(17)4-5-11(10)24-16/h4-5,7-8H,2-3,6H2,1H3,(H2,18,19,20)
Reactome pathway
n/an/an/an/a 2.00E+4n/an/a7.237
Conforma Therapeutics Corporation
Assay Description
EC50 was defined as the concentration of the compound at which there was 50% degradation of the Her-2/neu protein in MCF7 breast carcinoma cells. Sam...
J Med Chem 49: 5352-62 (2006)
Article DOI: 10.1021/jm051146h
BindingDB Entry DOI: 10.7270/Q26M354P