null
SMILES: CCOP(=O)(CCn1c(Sc2nc3cncc(Br)c3s2)nc2c(N)ncnc12)OCC
InChI Key: InChIKey=SECQDSIPIFHPOE-UHFFFAOYSA-N
Activity Spreadsheet -- Enzyme Inhibition Constant Data from BindingDB
Found 2 hits for monomerid = 20783
Trg + Lig
Ki
nM
ΔG°
kcal/mole
IC50
nM
Kd
nM
EC50/IC50
nM
koff
s-1
kon
M-1s-1
pHTemp
°C
Heat shock protein HSP 90-beta
(Homo sapiens (Human))
BDBM20783
(CHEMBL212133 | Pyridothiazole analogue, 27 | dieth...)
Show SMILES CCOP(=O)(CCn1c(Sc2nc3cncc(Br)c3s2)nc2c(N)ncnc12)OCC
Show InChI InChI=1S/C17H19BrN7O3PS2/c1-3-27-29(26,28-4-2)6-5-25-15-12(14(19)21-9-22-15)24-16(25)31-17-23-11-8-20-7-10(18)13(11)30-17/h7-9H,3-6H2,1-2H3,(H2,19,21,22)
Reactome pathway
n/an/a 28n/an/an/an/an/an/a
Memorial Sloan-Kettering Cancer Center
Curated by ChEMBL
Assay Description
Inhibition of Hsp90 in human MCF7 cells assessed as Her2 degradation
Bioorg Med Chem 17: 2225-35 (2009)
Article DOI: 10.1016/j.bmc.2008.10.087
BindingDB Entry DOI: 10.7270/Q2T72JCS
Heat shock protein HSP 90-beta
(Homo sapiens (Human))
BDBM20783
(CHEMBL212133 | Pyridothiazole analogue, 27 | dieth...)
Show SMILES CCOP(=O)(CCn1c(Sc2nc3cncc(Br)c3s2)nc2c(N)ncnc12)OCC
Show InChI InChI=1S/C17H19BrN7O3PS2/c1-3-27-29(26,28-4-2)6-5-25-15-12(14(19)21-9-22-15)24-16(25)31-17-23-11-8-20-7-10(18)13(11)30-17/h7-9H,3-6H2,1-2H3,(H2,19,21,22)
Reactome pathway
n/an/an/an/a 28n/an/an/an/a
Conforma Therapeutics Corporation
Assay Description
EC50 was defined as the concentration of the compound at which there was 50% degradation of the Her-2/neu protein in MCF7 breast carcinoma cells. Sam...
J Med Chem 49: 5352-62 (2006)
Article DOI: 10.1021/jm051146h
BindingDB Entry DOI: 10.7270/Q26M354P