BDBM208162 US9265773, 105::US9265773, 106
SMILES: CNC(=O)c1c(oc2cc(N(C)S(C)(=O)=O)c(cc12)-c1ccc2OC(C(N)=O)n3c(cc4c(F)cccc34)-c2n1)-c1ccc(F)cc1
InChI Key: InChIKey=KDLJFFPIKPQVLW-UHFFFAOYSA-N
Data: 4 IC50
Activity Spreadsheet -- Enzyme Inhibition Constant Data from BindingDB
Found 4 hits for monomerid = 208162
Trg + Lig
Ki
nM
ΔG°
kcal/mole
IC50
nM
Kd
nM
EC50/IC50
nM
koff
s-1
kon
M-1s-1
pHTemp
°C
HCV NS3-NS4A Serine Proteinase
(Hepatitis C virus (HCV genotype 1a, isolate H))
BDBM208162
(US9265773, 105 | US9265773, 106)
Show SMILES CNC(=O)c1c(oc2cc(N(C)S(C)(=O)=O)c(cc12)-c1ccc2OC(C(N)=O)n3c(cc4c(F)cccc34)-c2n1)-c1ccc(F)cc1
Show InChI InChI=1S/C33H25F2N5O6S/c1-37-32(42)28-20-13-19(24(39(2)47(3,43)44)15-27(20)45-30(28)16-7-9-17(34)10-8-16)22-11-12-26-29(38-22)25-14-18-21(35)5-4-6-23(18)40(25)33(46-26)31(36)41/h4-15,33H,1-3H3,(H2,36,41)(H,37,42)
US Patent
n/an/a 1.40n/an/an/an/an/an/a
Merck Sharp & Dohme Corp.; MSD Italia S.R.L.
US Patent
Assay Description
Measurement of inhibition by compounds was performed using the HCV replicon system. Several different replicons encoding different HCV genotypes or m...
US Patent US9265773 (2016)
BindingDB Entry DOI: 10.7270/Q2XD10H7
NS3 serine protease (NS3)
(Hepatitis C Virus (Virus))
BDBM208162
(US9265773, 105 | US9265773, 106)
Show SMILES CNC(=O)c1c(oc2cc(N(C)S(C)(=O)=O)c(cc12)-c1ccc2OC(C(N)=O)n3c(cc4c(F)cccc34)-c2n1)-c1ccc(F)cc1
Show InChI InChI=1S/C33H25F2N5O6S/c1-37-32(42)28-20-13-19(24(39(2)47(3,43)44)15-27(20)45-30(28)16-7-9-17(34)10-8-16)22-11-12-26-29(38-22)25-14-18-21(35)5-4-6-23(18)40(25)33(46-26)31(36)41/h4-15,33H,1-3H3,(H2,36,41)(H,37,42)
US Patent
n/an/a 2.40n/an/an/an/an/an/a
Merck Sharp & Dohme Corp.; MSD Italia S.R.L.
US Patent
Assay Description
Measurement of inhibition by compounds was performed using the HCV replicon system. Several different replicons encoding different HCV genotypes or m...
US Patent US9265773 (2016)
BindingDB Entry DOI: 10.7270/Q2XD10H7
NS3 serine protease (NS3)
(Hepatitis C Virus (Virus))
BDBM208162
(US9265773, 105 | US9265773, 106)
Show SMILES CNC(=O)c1c(oc2cc(N(C)S(C)(=O)=O)c(cc12)-c1ccc2OC(C(N)=O)n3c(cc4c(F)cccc34)-c2n1)-c1ccc(F)cc1
Show InChI InChI=1S/C33H25F2N5O6S/c1-37-32(42)28-20-13-19(24(39(2)47(3,43)44)15-27(20)45-30(28)16-7-9-17(34)10-8-16)22-11-12-26-29(38-22)25-14-18-21(35)5-4-6-23(18)40(25)33(46-26)31(36)41/h4-15,33H,1-3H3,(H2,36,41)(H,37,42)
US Patent
n/an/a 0.900n/an/an/an/an/an/a
Merck Sharp & Dohme Corp.; MSD Italia S.R.L.
US Patent
Assay Description
Measurement of inhibition by compounds was performed using the HCV replicon system. Several different replicons encoding different HCV genotypes or m...
US Patent US9265773 (2016)
BindingDB Entry DOI: 10.7270/Q2XD10H7
HCV NS3-NS4A Serine Proteinase
(Hepatitis C virus (HCV genotype 1a, isolate H))
BDBM208162
(US9265773, 105 | US9265773, 106)
Show SMILES CNC(=O)c1c(oc2cc(N(C)S(C)(=O)=O)c(cc12)-c1ccc2OC(C(N)=O)n3c(cc4c(F)cccc34)-c2n1)-c1ccc(F)cc1
Show InChI InChI=1S/C33H25F2N5O6S/c1-37-32(42)28-20-13-19(24(39(2)47(3,43)44)15-27(20)45-30(28)16-7-9-17(34)10-8-16)22-11-12-26-29(38-22)25-14-18-21(35)5-4-6-23(18)40(25)33(46-26)31(36)41/h4-15,33H,1-3H3,(H2,36,41)(H,37,42)
US Patent
n/an/a 5.5n/an/an/an/an/an/a
Merck Sharp & Dohme Corp.; MSD Italia S.R.L.
US Patent
Assay Description
Measurement of inhibition by compounds was performed using the HCV replicon system. Several different replicons encoding different HCV genotypes or m...
US Patent US9265773 (2016)
BindingDB Entry DOI: 10.7270/Q2XD10H7