BDBM208475 US9266869, 33
SMILES: COC(=O)CCCC[S@@](C)(=O)=NC(=O)c1cnc(N)c(c1)C#Cc1cccc(NC(=O)c2occc2C)c1
InChI Key: InChIKey=SXGZAYZKUGJQPT-KXQOOQHDSA-N
Data: 4 IC50
Activity Spreadsheet -- Enzyme Inhibition Constant Data from BindingDB
Found 4 hits for monomerid = 208475
Trg + Lig
Ki
nM
ΔG°
kcal/mole
IC50
nM
Kd
nM
EC50/IC50
nM
koff
s-1
kon
M-1s-1
pHTemp
°C
Vascular endothelial growth factor receptor 2
(Homo sapiens (Human))
BDBM208475
(US9266869, 33)
Show SMILES COC(=O)CCCC[S@@](C)(=O)=NC(=O)c1cnc(N)c(c1)C#Cc1cccc(NC(=O)c2occc2C)c1 |r|
Show InChI InChI=1S/C27H28N4O6S/c1-18-12-13-37-24(18)27(34)30-22-8-6-7-19(15-22)10-11-20-16-21(17-29-25(20)28)26(33)31-38(3,35)14-5-4-9-23(32)36-2/h6-8,12-13,15-17H,4-5,9,14H2,1-3H3,(H2,28,29)(H,30,34)/t38-/m1/s1
NCI pathway
Reactome pathway
US Patent
n/an/a 6n/an/an/an/a7.430
Allergan, Inc.
US Patent
Assay Description
Biochemical KDR kinase assays were performed in 96 well microtiter plates that were coated overnight with 75 ug/well of poly-Glu-Tyr (4:1) in 10 mM P...
US Patent US9266869 (2016)
BindingDB Entry DOI: 10.7270/Q2NV9H33
Platelet-derived growth factor receptor beta
(Homo sapiens (Human))
BDBM208475
(US9266869, 33)
Show SMILES COC(=O)CCCC[S@@](C)(=O)=NC(=O)c1cnc(N)c(c1)C#Cc1cccc(NC(=O)c2occc2C)c1 |r|
Show InChI InChI=1S/C27H28N4O6S/c1-18-12-13-37-24(18)27(34)30-22-8-6-7-19(15-22)10-11-20-16-21(17-29-25(20)28)26(33)31-38(3,35)14-5-4-9-23(32)36-2/h6-8,12-13,15-17H,4-5,9,14H2,1-3H3,(H2,28,29)(H,30,34)/t38-/m1/s1
NCI pathway
Reactome pathway
US Patent
n/an/a 86n/an/an/an/an/a37
Allergan, Inc.
US Patent
Assay Description
Automated FLIPR (Fluorometric Imaging Plate Reader) technology was used to screen for inhibitors of PDGF-induced increases in intracellular calcium l...
US Patent US9266869 (2016)
BindingDB Entry DOI: 10.7270/Q2NV9H33
Platelet-derived growth factor receptor beta
(Homo sapiens (Human))
BDBM208475
(US9266869, 33)
Show SMILES COC(=O)CCCC[S@@](C)(=O)=NC(=O)c1cnc(N)c(c1)C#Cc1cccc(NC(=O)c2occc2C)c1 |r|
Show InChI InChI=1S/C27H28N4O6S/c1-18-12-13-37-24(18)27(34)30-22-8-6-7-19(15-22)10-11-20-16-21(17-29-25(20)28)26(33)31-38(3,35)14-5-4-9-23(32)36-2/h6-8,12-13,15-17H,4-5,9,14H2,1-3H3,(H2,28,29)(H,30,34)/t38-/m1/s1
NCI pathway
Reactome pathway
US Patent
n/an/a 27n/an/an/an/a7.430
Allergan, Inc.
US Patent
Assay Description
Biochemical PDGFRbeta kinase assays were performed in 96 well microtiter plates that were coated overnight with 75 ug of poly-Glu-Tyr (4:1) in 10 mM ...
US Patent US9266869 (2016)
BindingDB Entry DOI: 10.7270/Q2NV9H33
Vascular endothelial growth factor receptor 2
(Homo sapiens (Human))
BDBM208475
(US9266869, 33)
Show SMILES COC(=O)CCCC[S@@](C)(=O)=NC(=O)c1cnc(N)c(c1)C#Cc1cccc(NC(=O)c2occc2C)c1 |r|
Show InChI InChI=1S/C27H28N4O6S/c1-18-12-13-37-24(18)27(34)30-22-8-6-7-19(15-22)10-11-20-16-21(17-29-25(20)28)26(33)31-38(3,35)14-5-4-9-23(32)36-2/h6-8,12-13,15-17H,4-5,9,14H2,1-3H3,(H2,28,29)(H,30,34)/t38-/m1/s1
NCI pathway
Reactome pathway
US Patent
n/an/a 1n/an/an/an/an/a37
Allergan, Inc.
US Patent
Assay Description
Automated FLIPR (Fluorometric Imaging Plate Reader) technology was used to screen for inhibitors of VEGF induced increases in intracellular calcium...
US Patent US9266869 (2016)
BindingDB Entry DOI: 10.7270/Q2NV9H33