BDBM20856 4-amino-6-chloro-3-[2-(pyridin-4-yl)-1,3-thiazol-4-yl]-1,2-dihydroquinolin-2-one::quinolin-2(1H)-one derivative, 13e
SMILES: Nc1c(-c2csc(n2)-c2ccncc2)c(=O)[nH]c2ccc(Cl)cc12
InChI Key: InChIKey=HUHQPIYUPMEDGV-UHFFFAOYSA-N
Data: 1 IC50
Activity Spreadsheet -- Enzyme Inhibition Constant Data from BindingDB
Found 1 hit for monomerid = 20856
Trg + Lig
Ki
nM
ΔG°
kcal/mole
IC50
nM
Kd
nM
EC50/IC50
nM
koff
s-1
kon
M-1s-1
pHTemp
°C
Cyclin-Dependent Kinase 5 (CDK5)
(Homo sapiens (Human))
BDBM20856
(4-amino-6-chloro-3-[2-(pyridin-4-yl)-1,3-thiazol-4...)
Show SMILES Nc1c(-c2csc(n2)-c2ccncc2)c(=O)[nH]c2ccc(Cl)cc12
Show InChI InChI=1S/C17H11ClN4OS/c18-10-1-2-12-11(7-10)15(19)14(16(23)21-12)13-8-24-17(22-13)9-3-5-20-6-4-9/h1-8H,(H3,19,21,23)
NCI pathway
Reactome pathway
n/an/a 3.80n/an/an/an/a7.525
Amgen
Assay Description
In vitro CDK assay using purified enzyme, was incubated at 25 °C with substrate, and test compounds in the presence of ATP/ [gamma-33P] ATP. 33P...
Bioorg Med Chem Lett 17: 5384-9 (2007)
Article DOI: 10.1016/j.bmcl.2007.07.045
BindingDB Entry DOI: 10.7270/Q2TD9VNG