BDBM208633 US9266876, 100
SMILES: C[C@@H]1CN(CCN1C(=O)Cn1cnc2cccnc12)c1scnc1-c1nc2ccc(cc2[nH]1)-c1ccccc1
InChI Key: InChIKey=NSNKTVMNOZLWAV-LJQANCHMSA-N
Data: 1 IC50
Activity Spreadsheet -- Enzyme Inhibition Constant Data from BindingDB
Found 1 hit for monomerid = 208633
Trg + Lig
Ki
nM
ΔG°
kcal/mole
IC50
nM
Kd
nM
EC50/IC50
nM
koff
s-1
kon
M-1s-1
pHTemp
°C
C-X-C chemokine receptor type 3/Guanine nucleotide-binding protein subunit alpha-15
(Homo sapiens (Human))
BDBM208633
(US9266876, 100)
Show SMILES C[C@@H]1CN(CCN1C(=O)Cn1cnc2cccnc12)c1scnc1-c1nc2ccc(cc2[nH]1)-c1ccccc1
Show InChI InChI=1S/C29H26N8OS/c1-19-15-35(12-13-37(19)25(38)16-36-17-31-23-8-5-11-30-28(23)36)29-26(32-18-39-29)27-33-22-10-9-21(14-24(22)34-27)20-6-3-2-4-7-20/h2-11,14,17-19H,12-13,15-16H2,1H3,(H,33,34)/t19-/m1/s1
US Patent
n/an/a 1n/an/an/an/a7.437
Actelion Pharmaceuticals Ltd.
US Patent
Assay Description
The bioactivity of compounds is tested in a fluorometric imaging plate reader (FLIPR: Molecular Devices) using engineered CHO-K1 cells expressing the...
US Patent US9266876 (2016)
BindingDB Entry DOI: 10.7270/Q2DB80NB