null
SMILES: CC(O)c1ccc2[nH]c(nc2c1)-c1nc(sc1N1CCN([C@H](C)C1)C(=O)Cn1cnc2cccnc12)C(F)(F)F
InChI Key: InChIKey=GUACISYFMJNFES-GICMACPYSA-N
Activity Spreadsheet -- Enzyme Inhibition Constant Data from BindingDB
Found 1 hit for monomerid = 208699
Trg + Lig
Ki
nM
ΔG°
kcal/mole
IC50
nM
Kd
nM
EC50/IC50
nM
koff
s-1
kon
M-1s-1
pHTemp
°C
C-X-C chemokine receptor type 3/Guanine nucleotide-binding protein subunit alpha-15
(Homo sapiens (Human))
BDBM208699
(US9266876, 166)
Show SMILES CC(O)c1ccc2[nH]c(nc2c1)-c1nc(sc1N1CCN([C@H](C)C1)C(=O)Cn1cnc2cccnc12)C(F)(F)F
Show InChI InChI=1S/C26H25F3N8O2S/c1-14-11-35(8-9-37(14)20(39)12-36-13-31-18-4-3-7-30-23(18)36)24-21(34-25(40-24)26(27,28)29)22-32-17-6-5-16(15(2)38)10-19(17)33-22/h3-7,10,13-15,38H,8-9,11-12H2,1-2H3,(H,32,33)/t14-,15?/m1/s1
US Patent
n/an/a 1n/an/an/an/a7.437
Actelion Pharmaceuticals Ltd.
US Patent
Assay Description
The bioactivity of compounds is tested in a fluorometric imaging plate reader (FLIPR: Molecular Devices) using engineered CHO-K1 cells expressing the...
US Patent US9266876 (2016)
BindingDB Entry DOI: 10.7270/Q2DB80NB