BDBM208700 US9266876, 167
SMILES: COC(=O)c1ccc2[nH]c(nc2c1)-c1nc(sc1N1CCN([C@H](C)C1)C(=O)Cn1cnc2cccnc12)C(F)(F)F
InChI Key: InChIKey=NPNZCOPQACHOOM-CQSZACIVSA-N
Data: 1 IC50
Activity Spreadsheet -- Enzyme Inhibition Constant Data from BindingDB
Found 1 hit for monomerid = 208700
Trg + Lig
Ki
nM
ΔG°
kcal/mole
IC50
nM
Kd
nM
EC50/IC50
nM
koff
s-1
kon
M-1s-1
pHTemp
°C
CXCR3A / G protein (Galpha(16))
(Homo sapiens (Human))
BDBM208700
(US9266876, 167)
Show SMILES COC(=O)c1ccc2[nH]c(nc2c1)-c1nc(sc1N1CCN([C@H](C)C1)C(=O)Cn1cnc2cccnc12)C(F)(F)F
Show InChI InChI=1S/C26H23F3N8O3S/c1-14-11-35(8-9-37(14)19(38)12-36-13-31-17-4-3-7-30-22(17)36)23-20(34-25(41-23)26(27,28)29)21-32-16-6-5-15(24(39)40-2)10-18(16)33-21/h3-7,10,13-14H,8-9,11-12H2,1-2H3,(H,32,33)/t14-/m1/s1
US Patent
n/an/a 1n/an/an/an/a7.437
Actelion Pharmaceuticals Ltd.
US Patent
Assay Description
The bioactivity of compounds is tested in a fluorometric imaging plate reader (FLIPR: Molecular Devices) using engineered CHO-K1 cells expressing the...
US Patent US9266876 (2016)
BindingDB Entry DOI: 10.7270/Q2DB80NB