BDBM20883 3-(5-chloro-2,4-dihydroxyphenyl)-4-{4-[(diethylamino)methyl]phenyl}-N-ethyl-1H-pyrazole-5-carboxamide::Pyrazole, 19a
SMILES: CCNC(=O)c1[nH]nc(c1-c1ccc(CN(CC)CC)cc1)-c1cc(Cl)c(O)cc1O
InChI Key: InChIKey=NWYHNGNGYBSXMA-UHFFFAOYSA-N
Data: 1 IC50  1 EC50
Activity Spreadsheet -- Enzyme Inhibition Constant Data from BindingDB
Found 1 hit for monomerid = 20883
Trg + Lig
Ki
nM
ΔG°
kcal/mole
IC50
nM
Kd
nM
EC50/IC50
nM
koff
s-1
kon
M-1s-1
pHTemp
°C
Heat shock protein HSP 90-beta
(Homo sapiens (Human))
BDBM20883
(3-(5-chloro-2,4-dihydroxyphenyl)-4-{4-[(diethylami...)
Show SMILES CCNC(=O)c1[nH]nc(c1-c1ccc(CN(CC)CC)cc1)-c1cc(Cl)c(O)cc1O
Show InChI InChI=1S/C23H27ClN4O3/c1-4-25-23(31)22-20(15-9-7-14(8-10-15)13-28(5-2)6-3)21(26-27-22)16-11-17(24)19(30)12-18(16)29/h7-12,29-30H,4-6,13H2,1-3H3,(H,25,31)(H,26,27)
Reactome pathway
n/an/a 146n/a 315n/an/a7.422
Vernalis (R&D) Ltd
Assay Description
The assay is based upon displacement of a fluorescently labeled molecule, which binds specifically to the ATP-binding site of full-length human Hsp90...
J Med Chem 51: 196-218 (2008)
Article DOI: 10.1021/jm701018h
BindingDB Entry DOI: 10.7270/Q2JW8C5C