BDBM209 CGP 53820 analog::ethyl N-[(1S)-1-{[(2S,3S)-4-[(2S)-N'-(cyclohexylmethyl)-2-[(methoxycarbonyl)amino]-3-methylbutanehydrazido]-3-hydroxy-1-phenylbutan-2-yl]carbamoyl}-2-methylpropyl]carbamate
SMILES: CCOC(=O)N[C@@H](C(C)C)C(=O)N[C@@H](Cc1ccccc1)[C@@H](O)CN(CC1CCCCC1)NC(=O)[C@@H](NC(=O)OC)C(C)C
InChI Key: InChIKey=HHZVZJSOAPPIMO-LJWNLINESA-N
Data: 1 IC50
Activity Spreadsheet -- Enzyme Inhibition Constant Data from BindingDB
Found 1 hit for monomerid = 209
Trg + Lig
Ki
nM
ΔG°
kcal/mole
IC50
nM
Kd
nM
EC50/IC50
nM
koff
s-1
kon
M-1s-1
pHTemp
°C
HIV-1 Protease
(Human immunodeficiency virus type 1)
BDBM209
(CGP 53820 analog | ethyl N-[(1S)-1-{[(2S,3S)-4-[(2...)
Show SMILES CCOC(=O)N[C@@H](C(C)C)C(=O)N[C@@H](Cc1ccccc1)[C@@H](O)CN(CC1CCCCC1)NC(=O)[C@@H](NC(=O)OC)C(C)C |r|
Show InChI InChI=1S/C32H53N5O7/c1-7-44-32(42)35-27(21(2)3)29(39)33-25(18-23-14-10-8-11-15-23)26(38)20-37(19-24-16-12-9-13-17-24)36-30(40)28(22(4)5)34-31(41)43-6/h8,10-11,14-15,21-22,24-28,38H,7,9,12-13,16-20H2,1-6H3,(H,33,39)(H,34,41)(H,35,42)(H,36,40)/t25-,26-,27-,28-/m0/s1
n/an/a 76n/an/an/an/a6.037
Ciba-Geigy Ltd.
Assay Description
A peptide cleavage assay was performed using the icosapeptide H-Arg-Arg-Ser-Asn-Gln-Val-Ser-Gln-Asn-Tyr-Pro-Ile-Val-Gln-Asn-Ile-Gln-Gly-Arg-Arg-OH, a...
J Med Chem 39: 3203-16 (1996)
Article DOI: 10.1021/jm960022p
BindingDB Entry DOI: 10.7270/Q2FT8J7Q