BDBM209177 US9266877, 123
SMILES: CCOC(=O)c1cc(c(C)n1Cc1ccccc1)-c1ccc(nc1C(O)=O)N1CCc2cccc(C(=O)Nc3nc4ccccc4s3)c2C1
InChI Key: InChIKey=DCHXJHQLHSYQHK-UHFFFAOYSA-N
Data: 1 KI  1 EC50
Activity Spreadsheet -- Enzyme Inhibition Constant Data from BindingDB
Found 2 hits for monomerid = 209177
Trg + Lig
Ki
nM
ΔG°
kcal/mole
IC50
nM
Kd
nM
EC50/IC50
nM
koff
s-1
kon
M-1s-1
pHTemp
°C
Bcl-2-like protein 1
(Homo sapiens (Human))
BDBM209177
(US9266877, 123)
Show SMILES CCOC(=O)c1cc(c(C)n1Cc1ccccc1)-c1ccc(nc1C(O)=O)N1CCc2cccc(C(=O)Nc3nc4ccccc4s3)c2C1
Show InChI InChI=1S/C38H33N5O5S/c1-3-48-37(47)31-20-28(23(2)43(31)21-24-10-5-4-6-11-24)26-16-17-33(40-34(26)36(45)46)42-19-18-25-12-9-13-27(29(25)22-42)35(44)41-38-39-30-14-7-8-15-32(30)49-38/h4-17,20H,3,18-19,21-22H2,1-2H3,(H,45,46)(H,39,41,44)
NCI pathway
Reactome pathway
US Patent
<0.100<-13.6n/an/an/an/an/an/a25
ABBVIE INC.
US Patent
Assay Description
The measurement of competition of compounds of Formula (I) with F-Bak for a Bcl-2 family protein (Bcl-xL) binding site using a Time Resolved Fluoresc...
US Patent US9266877 (2016)
BindingDB Entry DOI: 10.7270/Q2H41Q7V
Apoptosis regulator Bcl-XL
(Mus musculus (Mouse))
BDBM209177
(US9266877, 123)
Show SMILES CCOC(=O)c1cc(c(C)n1Cc1ccccc1)-c1ccc(nc1C(O)=O)N1CCc2cccc(C(=O)Nc3nc4ccccc4s3)c2C1
Show InChI InChI=1S/C38H33N5O5S/c1-3-48-37(47)31-20-28(23(2)43(31)21-24-10-5-4-6-11-24)26-16-17-33(40-34(26)36(45)46)42-19-18-25-12-9-13-27(29(25)22-42)35(44)41-38-39-30-14-7-8-15-32(30)49-38/h4-17,20H,3,18-19,21-22H2,1-2H3,(H,45,46)(H,39,41,44)
US Patent
n/an/an/an/a 16n/an/an/an/a
ABBVIE INC.
US Patent
Assay Description
The efficacy of the compounds of Formula (I) can also be determined in cell-based killing assays using a variety of cell lines and mouse tumor models...
US Patent US9266877 (2016)
BindingDB Entry DOI: 10.7270/Q2H41Q7V