BDBM209211 US9266877, 157
SMILES: COC1(Cn2ncc(c2C)-c2ccc(nc2C(O)=O)N2CCc3cccc(C(=O)Nc4nc5ccccc5s4)c3C2)CCCC(C)(C)C1
InChI Key: InChIKey=PCJOKOQMKUYYRS-UHFFFAOYSA-N
Data: 1 KI  1 EC50
Activity Spreadsheet -- Enzyme Inhibition Constant Data from BindingDB
Found 2 hits for monomerid = 209211
Trg + Lig
Ki
nM
ΔG°
kcal/mole
IC50
nM
Kd
nM
EC50/IC50
nM
koff
s-1
kon
M-1s-1
pHTemp
°C
Bcl-2-like protein 1
(Homo sapiens (Human))
BDBM209211
(US9266877, 157)
Show SMILES COC1(Cn2ncc(c2C)-c2ccc(nc2C(O)=O)N2CCc3cccc(C(=O)Nc4nc5ccccc5s4)c3C2)CCCC(C)(C)C1
Show InChI InChI=1S/C37H40N6O4S/c1-23-27(19-38-43(23)22-37(47-4)17-8-16-36(2,3)21-37)25-13-14-31(40-32(25)34(45)46)42-18-15-24-9-7-10-26(28(24)20-42)33(44)41-35-39-29-11-5-6-12-30(29)48-35/h5-7,9-14,19H,8,15-18,20-22H2,1-4H3,(H,45,46)(H,39,41,44)
NCI pathway
Reactome pathway
US Patent
<0.100<-13.6n/an/an/an/an/an/a25
ABBVIE INC.
US Patent
Assay Description
The measurement of competition of compounds of Formula (I) with F-Bak for a Bcl-2 family protein (Bcl-xL) binding site using a Time Resolved Fluoresc...
US Patent US9266877 (2016)
BindingDB Entry DOI: 10.7270/Q2H41Q7V
Apoptosis regulator Bcl-XL
(Mus musculus (Mouse))
BDBM209211
(US9266877, 157)
Show SMILES COC1(Cn2ncc(c2C)-c2ccc(nc2C(O)=O)N2CCc3cccc(C(=O)Nc4nc5ccccc5s4)c3C2)CCCC(C)(C)C1
Show InChI InChI=1S/C37H40N6O4S/c1-23-27(19-38-43(23)22-37(47-4)17-8-16-36(2,3)21-37)25-13-14-31(40-32(25)34(45)46)42-18-15-24-9-7-10-26(28(24)20-42)33(44)41-35-39-29-11-5-6-12-30(29)48-35/h5-7,9-14,19H,8,15-18,20-22H2,1-4H3,(H,45,46)(H,39,41,44)
US Patent
n/an/an/an/a 0.300n/an/an/an/a
ABBVIE INC.
US Patent
Assay Description
The efficacy of the compounds of Formula (I) can also be determined in cell-based killing assays using a variety of cell lines and mouse tumor models...
US Patent US9266877 (2016)
BindingDB Entry DOI: 10.7270/Q2H41Q7V