BDBM209236 US9266877, 182
SMILES: OC(=O)c1nc(ccc1-c1cccc(N2CCCC2C23CC4CC(CC(C4)C2)C3)c1C#N)N1CCc2cccc(C(=O)Nc3nc4ccccc4s3)c2C1
InChI Key: InChIKey=BUTLYSQOBKRKIW-UHFFFAOYSA-N
Data: 1 KI  1 EC50
Activity Spreadsheet -- Enzyme Inhibition Constant Data from BindingDB
Found 2 hits for monomerid = 209236
Trg + Lig
Ki
nM
ΔG°
kcal/mole
IC50
nM
Kd
nM
EC50/IC50
nM
koff
s-1
kon
M-1s-1
pHTemp
°C
Bcl-2-like protein 1
(Homo sapiens (Human))
BDBM209236
(US9266877, 182)
Show SMILES OC(=O)c1nc(ccc1-c1cccc(N2CCCC2C23CC4CC(CC(C4)C2)C3)c1C#N)N1CCc2cccc(C(=O)Nc3nc4ccccc4s3)c2C1 |TLB:26:25:28:20.21.22,THB:24:25:20:28.22.23|
Show InChI InChI=1S/C44H42N6O3S/c45-24-33-30(7-4-10-36(33)50-16-5-12-38(50)44-21-26-18-27(22-44)20-28(19-26)23-44)31-13-14-39(47-40(31)42(52)53)49-17-15-29-6-3-8-32(34(29)25-49)41(51)48-43-46-35-9-1-2-11-37(35)54-43/h1-4,6-11,13-14,26-28,38H,5,12,15-23,25H2,(H,52,53)(H,46,48,51)
NCI pathway
Reactome pathway
US Patent
0.200 -13.2n/an/an/an/an/an/a25
ABBVIE INC.
US Patent
Assay Description
The measurement of competition of compounds of Formula (I) with F-Bak for a Bcl-2 family protein (Bcl-xL) binding site using a Time Resolved Fluoresc...
US Patent US9266877 (2016)
BindingDB Entry DOI: 10.7270/Q2H41Q7V
Apoptosis regulator Bcl-XL
(Mus musculus (Mouse))
BDBM209236
(US9266877, 182)
Show SMILES OC(=O)c1nc(ccc1-c1cccc(N2CCCC2C23CC4CC(CC(C4)C2)C3)c1C#N)N1CCc2cccc(C(=O)Nc3nc4ccccc4s3)c2C1 |TLB:26:25:28:20.21.22,THB:24:25:20:28.22.23|
Show InChI InChI=1S/C44H42N6O3S/c45-24-33-30(7-4-10-36(33)50-16-5-12-38(50)44-21-26-18-27(22-44)20-28(19-26)23-44)31-13-14-39(47-40(31)42(52)53)49-17-15-29-6-3-8-32(34(29)25-49)41(51)48-43-46-35-9-1-2-11-37(35)54-43/h1-4,6-11,13-14,26-28,38H,5,12,15-23,25H2,(H,52,53)(H,46,48,51)
US Patent
n/an/an/an/a 6n/an/an/an/a
ABBVIE INC.
US Patent
Assay Description
The efficacy of the compounds of Formula (I) can also be determined in cell-based killing assays using a variety of cell lines and mouse tumor models...
US Patent US9266877 (2016)
BindingDB Entry DOI: 10.7270/Q2H41Q7V