BDBM20925 5-(5-tert-butyl-2,4-dihydroxyphenyl)-N-ethyl-4-[4-(piperidin-1-ylmethyl)phenyl]-1,2-oxazole-3-carboxamide::Isoxazole, 41g::US10413550, Example 77c::US9718793, 77c
SMILES: CCNC(=O)c1noc(c1-c1ccc(CN2CCCCC2)cc1)-c1cc(c(O)cc1O)C(C)(C)C
InChI Key: InChIKey=COBVQNNJVURGON-UHFFFAOYSA-N
Data: 3 IC50  1 EC50
Activity Spreadsheet -- Enzyme Inhibition Constant Data from BindingDB
Found 3 hits for monomerid = 20925
Trg + Lig
Ki
nM
ΔG°
kcal/mole
IC50
nM
Kd
nM
EC50/IC50
nM
koff
s-1
kon
M-1s-1
pHTemp
°C
Heat shock protein HSP 90-beta
(Homo sapiens (Human))
BDBM20925
(5-(5-tert-butyl-2,4-dihydroxyphenyl)-N-ethyl-4-[4-...)
Show SMILES CCNC(=O)c1noc(c1-c1ccc(CN2CCCCC2)cc1)-c1cc(c(O)cc1O)C(C)(C)C
Show InChI InChI=1S/C28H35N3O4/c1-5-29-27(34)25-24(19-11-9-18(10-12-19)17-31-13-7-6-8-14-31)26(35-30-25)20-15-21(28(2,3)4)23(33)16-22(20)32/h9-12,15-16,32-33H,5-8,13-14,17H2,1-4H3,(H,29,34)
Reactome pathway
n/an/a 11n/a 65n/an/an/an/a
Vernalis (R&D) Ltd
Assay Description
The assay is based upon displacement of a fluorescently labeled molecule, which binds specifically to the ATP-binding site of full-length human Hsp90...
J Med Chem 51: 196-218 (2008)
Article DOI: 10.1021/jm701018h
BindingDB Entry DOI: 10.7270/Q2JW8C5C
HSP90
(Homo sapiens (Human)-Alligator mississippiensis (A...)
BDBM20925
(5-(5-tert-butyl-2,4-dihydroxyphenyl)-N-ethyl-4-[4-...)
Show SMILES CCNC(=O)c1noc(c1-c1ccc(CN2CCCCC2)cc1)-c1cc(c(O)cc1O)C(C)(C)C
Show InChI InChI=1S/C28H35N3O4/c1-5-29-27(34)25-24(19-11-9-18(10-12-19)17-31-13-7-6-8-14-31)26(35-30-25)20-15-21(28(2,3)4)23(33)16-22(20)32/h9-12,15-16,32-33H,5-8,13-14,17H2,1-4H3,(H,29,34)
Reactome pathway
US Patent
n/an/a<1.00E+4n/an/an/an/an/an/a
The Institute of Cancer Research
US Patent
Assay Description
(1) Greiner 384-well (Greiner 781101) or Costar 384-well flat-bottomed polystyrene multiwell plates (VWR). (2) Assay buffer of (a) 100 mM Tris...
US Patent US10413550 (2019)
BindingDB Entry DOI: 10.7270/Q2C82CP2
Heat shock protein HSP 90-alpha
(Homo sapiens (Human))
BDBM20925
(5-(5-tert-butyl-2,4-dihydroxyphenyl)-N-ethyl-4-[4-...)
Show SMILES CCNC(=O)c1noc(c1-c1ccc(CN2CCCCC2)cc1)-c1cc(c(O)cc1O)C(C)(C)C
Show InChI InChI=1S/C28H35N3O4/c1-5-29-27(34)25-24(19-11-9-18(10-12-19)17-31-13-7-6-8-14-31)26(35-30-25)20-15-21(28(2,3)4)23(33)16-22(20)32/h9-12,15-16,32-33H,5-8,13-14,17H2,1-4H3,(H,29,34)
NCI pathway
Reactome pathway
US Patent
n/an/a<1.00E+4n/an/an/an/an/an/a
Vernalis (R&D) Ltd.; Cancer Research Technology Limited; The Institute of Cancer Research
US Patent
Assay Description
Chemicals are of the highest purity commercially available and all aqueous solutions are made up in AR water. Because of the need to minimise contami...
US Patent US9718793 (2017)
BindingDB Entry DOI: 10.7270/Q2SQ92DM