BDBM209307 US9266883, 65
SMILES: OC[C@H]1[C@@H]2CC[C@@H](C2)[C@H]1Nc1cc(NC(=O)N2CCCc3cc(CO)c(C=O)nc23)ncc1C#N
InChI Key: InChIKey=SDHQRIQSXBFHGR-YBYFIDKVSA-N
Data: 1 IC50
Activity Spreadsheet -- Enzyme Inhibition Constant Data from BindingDB
Found 1 hit for monomerid = 209307
Trg + Lig
Ki
nM
ΔG°
kcal/mole
IC50
nM
Kd
nM
EC50/IC50
nM
koff
s-1
kon
M-1s-1
pHTemp
°C
Fibroblast growth factor receptor 4 (FGFR4)
(Homo sapiens (Human))
BDBM209307
(US9266883, 65)
Show SMILES OC[C@H]1[C@@H]2CC[C@@H](C2)[C@H]1Nc1cc(NC(=O)N2CCCc3cc(CO)c(C=O)nc23)ncc1C#N |r|
Show InChI InChI=1S/C25H28N6O4/c26-9-18-10-27-22(8-20(18)28-23-15-4-3-14(6-15)19(23)12-33)30-25(35)31-5-1-2-16-7-17(11-32)21(13-34)29-24(16)31/h7-8,10,13-15,19,23,32-33H,1-6,11-12H2,(H2,27,28,30,35)/t14-,15+,19+,23-/m1/s1
US Patent
n/an/a 0.800n/an/an/an/a7.530
Novartis AG
US Patent
Assay Description
Liquid handling and incubation steps were done on an Innovadyne Nanodrop Express equipped with a robotic arm (Thermo CatX, Caliper Twister II) and an...
US Patent US9266883 (2016)
BindingDB Entry DOI: 10.7270/Q2CC0ZGP