BDBM209393 US9266890, I-1
SMILES: CN1c2cnc(Nc3ccc(cn3)N3CCC(O)CC3)nc2N(CCC1=O)C1CCCC1
InChI Key: InChIKey=WUDDKNUPJTYVAB-UHFFFAOYSA-N
Data: 1 IC50  1 Kd
Activity Spreadsheet -- Enzyme Inhibition Constant Data from BindingDB
Found 2 hits for monomerid = 209393
Trg + Lig
Ki
nM
ΔG°
kcal/mole
IC50
nM
Kd
nM
EC50/IC50
nM
koff
s-1
kon
M-1s-1
pHTemp
°C
Serine/threonine-protein kinase PLK1
(Homo sapiens (Human))
BDBM209393
(US9266890, I-1)
Show SMILES CN1c2cnc(Nc3ccc(cn3)N3CCC(O)CC3)nc2N(CCC1=O)C1CCCC1
Show InChI InChI=1S/C23H31N7O2/c1-28-19-15-25-23(27-22(19)30(13-10-21(28)32)16-4-2-3-5-16)26-20-7-6-17(14-24-20)29-11-8-18(31)9-12-29/h6-7,14-16,18,31H,2-5,8-13H2,1H3,(H,24,25,26,27)
NCI pathway
Reactome pathway
US Patent
n/an/an/a 49n/an/an/an/an/a
Dana-Farber Cancer Institute, Inc.
US Patent
Assay Description
In vitro Plk1 binding assay: Ambit Kd values in nanomolar. Kd values generated by Ambit binding assay over a concentration range of the compound.
US Patent US9266890 (2016)
BindingDB Entry DOI: 10.7270/Q27M06RB
Dual specificity protein kinase TTK
(Homo sapiens (Human))
BDBM209393
(US9266890, I-1)
Show SMILES CN1c2cnc(Nc3ccc(cn3)N3CCC(O)CC3)nc2N(CCC1=O)C1CCCC1
Show InChI InChI=1S/C23H31N7O2/c1-28-19-15-25-23(27-22(19)30(13-10-21(28)32)16-4-2-3-5-16)26-20-7-6-17(14-24-20)29-11-8-18(31)9-12-29/h6-7,14-16,18,31H,2-5,8-13H2,1H3,(H,24,25,26,27)
US Patent
n/an/a 891n/an/an/an/an/a25
Dana-Farber Cancer Institute, Inc.
US Patent
Assay Description
Kinase reactions were carried out at room temperature with the following components: 1× kinase reaction buffer, 5 μg/mL (40 nM) Mps1 kinase, 200...
US Patent US9266890 (2016)
BindingDB Entry DOI: 10.7270/Q27M06RB