BDBM209405 US9266890, I-15
SMILES: CCN1c2cnc(Nc3ccc(cn3)N3CCC(O)CC3)nc2N(CCC1=O)C1CCCC1
InChI Key: InChIKey=FQANPQLBWHOHBK-UHFFFAOYSA-N
Data: 1 IC50
Activity Spreadsheet -- Enzyme Inhibition Constant Data from BindingDB
Found 1 hit for monomerid = 209405
Trg + Lig
Ki
nM
ΔG°
kcal/mole
IC50
nM
Kd
nM
EC50/IC50
nM
koff
s-1
kon
M-1s-1
pHTemp
°C
Dual specificity protein kinase TTK
(Homo sapiens (Human))
BDBM209405
(US9266890, I-15)
Show SMILES CCN1c2cnc(Nc3ccc(cn3)N3CCC(O)CC3)nc2N(CCC1=O)C1CCCC1
Show InChI InChI=1S/C24H33N7O2/c1-2-30-20-16-26-24(28-23(20)31(14-11-22(30)33)17-5-3-4-6-17)27-21-8-7-18(15-25-21)29-12-9-19(32)10-13-29/h7-8,15-17,19,32H,2-6,9-14H2,1H3,(H,25,26,27,28)
US Patent
n/an/a 3.45E+3n/an/an/an/an/a25
Dana-Farber Cancer Institute, Inc.
US Patent
Assay Description
Kinase reactions were carried out at room temperature with the following components: 1× kinase reaction buffer, 5 μg/mL (40 nM) Mps1 kinase, 200...
US Patent US9266890 (2016)
BindingDB Entry DOI: 10.7270/Q27M06RB