BDBM209477 US10328074, Example III-18::US9266891, III-18
SMILES: CC(C)Nc1nc(cn2c(C)nnc12)-c1nc2cnc(cc2n1Cc1ccccc1)N1CCN(C)CC1
InChI Key: InChIKey=NZXJUZMTDGHZSR-UHFFFAOYSA-N
Data: 2 IC50
Activity Spreadsheet -- Enzyme Inhibition Constant Data from BindingDB
Found 3 hits for monomerid = 209477
Trg + Lig
Ki
nM
ΔG°
kcal/mole
IC50
nM
Kd
nM
EC50/IC50
nM
koff
s-1
kon
M-1s-1
pHTemp
°C
BRD4-BD1 and Histone H4
(Homo sapiens (Human))
BDBM209477
(US10328074, Example III-18 | US9266891, III-18)
Show SMILES CC(C)Nc1nc(cn2c(C)nnc12)-c1nc2cnc(cc2n1Cc1ccccc1)N1CCN(C)CC1
Show InChI InChI=1S/C27H32N10/c1-18(2)29-25-27-33-32-19(3)36(27)17-22(30-25)26-31-21-15-28-24(35-12-10-34(4)11-13-35)14-23(21)37(26)16-20-8-6-5-7-9-20/h5-9,14-15,17-18H,10-13,16H2,1-4H3,(H,29,30)
US Patent
n/an/a 26n/an/an/an/an/an/a
Boehringer Ingelheim International GmbH
US Patent
Assay Description
Compounds are diluted in serial dilution 1:5 in assay buffer from 10 mM stock in DMSO (100 uM start concentration) in white OptiPlate-384 (PerkinElme...
US Patent US9266891 (2016)
BindingDB Entry DOI: 10.7270/Q23X85G7
Bromodomain-containing protein 4 (BRD4) (aa 44-168)
(Homo sapiens (Human))
US11077107, Example III-18
(US10328074, Example III-18 | US9266891, III-18)
Show SMILES CC(C)Nc1nc(cn2c(C)nnc12)-c1nc2cnc(cc2n1Cc1ccccc1)N1CCN(C)CC1
Show InChI InChI=1S/C27H32N10/c1-18(2)29-25-27-33-32-19(3)36(27)17-22(30-25)26-31-21-15-28-24(35-12-10-34(4)11-13-35)14-23(21)37(26)16-20-8-6-5-7-9-20/h5-9,14-15,17-18H,10-13,16H2,1-4H3,(H,29,30)
n/an/a 26n/an/an/an/an/an/a
TBA
Citation and Details
BRD4 BD1 (aa 42-168)
(Homo sapiens (Human))
BDBM209477
(US10328074, Example III-18 | US9266891, III-18)
Show SMILES CC(C)Nc1nc(cn2c(C)nnc12)-c1nc2cnc(cc2n1Cc1ccccc1)N1CCN(C)CC1
Show InChI InChI=1S/C27H32N10/c1-18(2)29-25-27-33-32-19(3)36(27)17-22(30-25)26-31-21-15-28-24(35-12-10-34(4)11-13-35)14-23(21)37(26)16-20-8-6-5-7-9-20/h5-9,14-15,17-18H,10-13,16H2,1-4H3,(H,29,30)
US Patent
n/an/a 26n/an/an/an/an/an/a
Duquesne University
Assay Description
This assay is used to determine whether the compounds inhibit the interaction between the first (BRD4-BD1) or the second (BRD4-BD2) bromodomain of BR...
Bioorg Med Chem 17: 7324-36 (2009)
BindingDB Entry DOI: 10.7270/Q20Z75M2