BDBM209495 US10328074, Example III-36::US9266891, III-36
SMILES: CC(C)Nc1nc(cn2c(C)nnc12)-c1nc2cnc(C)cc2n1Cc1ccccn1
InChI Key: InChIKey=BYHXJJUONGOTKC-UHFFFAOYSA-N
Data: 2 IC50
Activity Spreadsheet -- Enzyme Inhibition Constant Data from BindingDB
Found 3 hits for monomerid = 209495
Trg + Lig
Ki
nM
ΔG°
kcal/mole
IC50
nM
Kd
nM
EC50/IC50
nM
koff
s-1
kon
M-1s-1
pHTemp
°C
BRD4-BD1 and Histone H4
(Homo sapiens (Human))
BDBM209495
(US10328074, Example III-36 | US9266891, III-36)
Show SMILES CC(C)Nc1nc(cn2c(C)nnc12)-c1nc2cnc(C)cc2n1Cc1ccccn1
Show InChI InChI=1S/C22H23N9/c1-13(2)25-20-22-29-28-15(4)30(22)12-18(26-20)21-27-17-10-24-14(3)9-19(17)31(21)11-16-7-5-6-8-23-16/h5-10,12-13H,11H2,1-4H3,(H,25,26)
US Patent
n/an/a 28n/an/an/an/an/an/a
Boehringer Ingelheim International GmbH
US Patent
Assay Description
Compounds are diluted in serial dilution 1:5 in assay buffer from 10 mM stock in DMSO (100 uM start concentration) in white OptiPlate-384 (PerkinElme...
US Patent US9266891 (2016)
BindingDB Entry DOI: 10.7270/Q23X85G7
Bromodomain-containing protein 4 (BRD4) (aa 44-168)
(Homo sapiens (Human))
US11077107, Example III-36
(US10328074, Example III-36 | US9266891, III-36)
Show SMILES CC(C)Nc1nc(cn2c(C)nnc12)-c1nc2cnc(C)cc2n1Cc1ccccn1
Show InChI InChI=1S/C22H23N9/c1-13(2)25-20-22-29-28-15(4)30(22)12-18(26-20)21-27-17-10-24-14(3)9-19(17)31(21)11-16-7-5-6-8-23-16/h5-10,12-13H,11H2,1-4H3,(H,25,26)
n/an/a 28n/an/an/an/an/an/a
TBA
Citation and Details
BRD4 BD1 (aa 42-168)
(Homo sapiens (Human))
BDBM209495
(US10328074, Example III-36 | US9266891, III-36)
Show SMILES CC(C)Nc1nc(cn2c(C)nnc12)-c1nc2cnc(C)cc2n1Cc1ccccn1
Show InChI InChI=1S/C22H23N9/c1-13(2)25-20-22-29-28-15(4)30(22)12-18(26-20)21-27-17-10-24-14(3)9-19(17)31(21)11-16-7-5-6-8-23-16/h5-10,12-13H,11H2,1-4H3,(H,25,26)
US Patent
n/an/a 28n/an/an/an/an/an/a
Duquesne University
Assay Description
This assay is used to determine whether the compounds inhibit the interaction between the first (BRD4-BD1) or the second (BRD4-BD2) bromodomain of BR...
Bioorg Med Chem 17: 7324-36 (2009)
BindingDB Entry DOI: 10.7270/Q20Z75M2