BDBM209499 US10328074, Example III-40::US9266891, III-40
SMILES: CC(C)Nc1nc(cn2c(C)nnc12)-c1nc2cnc(cc2n1Cc1ccccn1)C(C)C
InChI Key: InChIKey=LMBQVBQBODBFRL-UHFFFAOYSA-N
Data: 2 IC50
Activity Spreadsheet -- Enzyme Inhibition Constant Data from BindingDB
Found 3 hits for monomerid = 209499
Trg + Lig
Ki
nM
ΔG°
kcal/mole
IC50
nM
Kd
nM
EC50/IC50
nM
koff
s-1
kon
M-1s-1
pHTemp
°C
BRD4-BD1 and Histone H4
(Homo sapiens (Human))
BDBM209499
(US10328074, Example III-40 | US9266891, III-40)
Show SMILES CC(C)Nc1nc(cn2c(C)nnc12)-c1nc2cnc(cc2n1Cc1ccccn1)C(C)C
Show InChI InChI=1S/C24H27N9/c1-14(2)18-10-21-19(11-26-18)29-23(33(21)12-17-8-6-7-9-25-17)20-13-32-16(5)30-31-24(32)22(28-20)27-15(3)4/h6-11,13-15H,12H2,1-5H3,(H,27,28)
US Patent
n/an/a 18n/an/an/an/an/an/a
Boehringer Ingelheim International GmbH
US Patent
Assay Description
Compounds are diluted in serial dilution 1:5 in assay buffer from 10 mM stock in DMSO (100 uM start concentration) in white OptiPlate-384 (PerkinElme...
US Patent US9266891 (2016)
BindingDB Entry DOI: 10.7270/Q23X85G7
Bromodomain-containing protein 4
(Homo sapiens (Human))
US11077107, Example III-40
(US10328074, Example III-40 | US9266891, III-40)
Show SMILES CC(C)Nc1nc(cn2c(C)nnc12)-c1nc2cnc(cc2n1Cc1ccccn1)C(C)C
Show InChI InChI=1S/C24H27N9/c1-14(2)18-10-21-19(11-26-18)29-23(33(21)12-17-8-6-7-9-25-17)20-13-32-16(5)30-31-24(32)22(28-20)27-15(3)4/h6-11,13-15H,12H2,1-5H3,(H,27,28)
n/an/a 18n/an/an/an/an/an/a
TBA
Citation and Details
BRD4 BD1 (aa 42-168)
(Homo sapiens (Human))
BDBM209499
(US10328074, Example III-40 | US9266891, III-40)
Show SMILES CC(C)Nc1nc(cn2c(C)nnc12)-c1nc2cnc(cc2n1Cc1ccccn1)C(C)C
Show InChI InChI=1S/C24H27N9/c1-14(2)18-10-21-19(11-26-18)29-23(33(21)12-17-8-6-7-9-25-17)20-13-32-16(5)30-31-24(32)22(28-20)27-15(3)4/h6-11,13-15H,12H2,1-5H3,(H,27,28)
US Patent
n/an/a 18n/an/an/an/an/an/a
Duquesne University
Assay Description
This assay is used to determine whether the compounds inhibit the interaction between the first (BRD4-BD1) or the second (BRD4-BD2) bromodomain of BR...
Bioorg Med Chem 17: 7324-36 (2009)
BindingDB Entry DOI: 10.7270/Q20Z75M2