BDBM209508 US10328074, Example III-49::US9266891, III-49
SMILES: CNc1nc(cn2c(C)nnc12)-c1nc2cnc(cc2n1Cc1cccnc1)N1CCOCC1
InChI Key: InChIKey=HWYPQYNAVWQEKO-UHFFFAOYSA-N
Data: 2 IC50
Activity Spreadsheet -- Enzyme Inhibition Constant Data from BindingDB
Found 3 hits for monomerid = 209508
Trg + Lig
Ki
nM
ΔG°
kcal/mole
IC50
nM
Kd
nM
EC50/IC50
nM
koff
s-1
kon
M-1s-1
pHTemp
°C
Bromodomain-containing protein 4 [44-168]/Histone H4
(Homo sapiens (Human))
BDBM209508
(US10328074, Example III-49 | US11077107, Example I...)
Show SMILES CNc1nc(cn2c(C)nnc12)-c1nc2cnc(cc2n1Cc1cccnc1)N1CCOCC1
Show InChI InChI=1S/C23H24N10O/c1-15-29-30-23-21(24-2)27-18(14-32(15)23)22-28-17-12-26-20(31-6-8-34-9-7-31)10-19(17)33(22)13-16-4-3-5-25-11-16/h3-5,10-12,14H,6-9,13H2,1-2H3,(H,24,27)
US Patent
n/an/a 4n/an/an/an/an/an/a
Boehringer Ingelheim International GmbH
US Patent
Assay Description
Compounds are diluted in serial dilution 1:5 in assay buffer from 10 mM stock in DMSO (100 uM start concentration) in white OptiPlate-384 (PerkinElme...
US Patent US9266891 (2016)
BindingDB Entry DOI: 10.7270/Q23X85G7
Bromodomain-containing protein 4 [44-168]
(Homo sapiens (Human))
BDBM209508
(US10328074, Example III-49 | US11077107, Example I...)
Show SMILES CNc1nc(cn2c(C)nnc12)-c1nc2cnc(cc2n1Cc1cccnc1)N1CCOCC1
Show InChI InChI=1S/C23H24N10O/c1-15-29-30-23-21(24-2)27-18(14-32(15)23)22-28-17-12-26-20(31-6-8-34-9-7-31)10-19(17)33(22)13-16-4-3-5-25-11-16/h3-5,10-12,14H,6-9,13H2,1-2H3,(H,24,27)
n/an/a 4n/an/an/an/an/an/a
TBA
Citation and Details
Bromodomain-containing protein 4 [42-168]
(Homo sapiens (Human))
BDBM209508
(US10328074, Example III-49 | US11077107, Example I...)
Show SMILES CNc1nc(cn2c(C)nnc12)-c1nc2cnc(cc2n1Cc1cccnc1)N1CCOCC1
Show InChI InChI=1S/C23H24N10O/c1-15-29-30-23-21(24-2)27-18(14-32(15)23)22-28-17-12-26-20(31-6-8-34-9-7-31)10-19(17)33(22)13-16-4-3-5-25-11-16/h3-5,10-12,14H,6-9,13H2,1-2H3,(H,24,27)
US Patent
n/an/a 4n/an/an/an/an/an/a
Duquesne University
Assay Description
This assay is used to determine whether the compounds inhibit the interaction between the first (BRD4-BD1) or the second (BRD4-BD2) bromodomain of BR...
Bioorg Med Chem 17: 7324-36 (2009)
BindingDB Entry DOI: 10.7270/Q20Z75M2