BDBM209734 US9273033, 32
SMILES: CCn1cc(ccc1=O)-c1cnc(C)nc1OC[C@H]1C[C@@H]1c1ccc2ccccc2n1
InChI Key: InChIKey=BPYLPYLSWFBRIH-UXHICEINSA-N
Data: 1 KI
Activity Spreadsheet -- Enzyme Inhibition Constant Data from BindingDB
Found 1 hit for monomerid = 209734
Trg + Lig
Ki
nM
ΔG°
kcal/mole
IC50
nM
Kd
nM
EC50/IC50
nM
koff
s-1
kon
M-1s-1
pHTemp
°C
cAMP and cAMP-inhibited cGMP 3',5'-cyclic phosphodiesterase 10A
(Homo sapiens (Human))
BDBM209734
(US9273033, 32)
Show SMILES CCn1cc(ccc1=O)-c1cnc(C)nc1OC[C@H]1C[C@@H]1c1ccc2ccccc2n1 |r|
Show InChI InChI=1S/C25H24N4O2/c1-3-29-14-18(9-11-24(29)30)21-13-26-16(2)27-25(21)31-15-19-12-20(19)23-10-8-17-6-4-5-7-22(17)28-23/h4-11,13-14,19-20H,3,12,15H2,1-2H3/t19-,20+/m1/s1
Reactome pathway
US Patent
0.0240 -14.5n/an/an/an/an/an/a25
Merck Sharp & Dohme Corp.
US Patent
Assay Description
The fluorescence polarization assay for cyclic nucleotide phosphodiesterases was performed using an IMAP FP kit supplied by Molecular Devices, Sunnyv...
US Patent US9273033 (2016)
BindingDB Entry DOI: 10.7270/Q26Q1W2R