BDBM209779 US9273033, 79
SMILES: Cc1ncc(-c2ccn(C)c(=O)c2)c(OC[C@H]2C[C@@H]2c2ccc3ccccc3n2)n1
InChI Key: InChIKey=TWRSCHYJESAPBR-MOPGFXCFSA-N
Data: 1 KI
Activity Spreadsheet -- Enzyme Inhibition Constant Data from BindingDB
Found 1 hit for monomerid = 209779
Trg + Lig
Ki
nM
ΔG°
kcal/mole
IC50
nM
Kd
nM
EC50/IC50
nM
koff
s-1
kon
M-1s-1
pHTemp
°C
cAMP and cAMP-inhibited cGMP 3',5'-cyclic phosphodiesterase 10A
(Homo sapiens (Human))
BDBM209779
(US9273033, 79)
Show SMILES Cc1ncc(-c2ccn(C)c(=O)c2)c(OC[C@H]2C[C@@H]2c2ccc3ccccc3n2)n1 |r|
Show InChI InChI=1S/C24H22N4O2/c1-15-25-13-20(17-9-10-28(2)23(29)12-17)24(26-15)30-14-18-11-19(18)22-8-7-16-5-3-4-6-21(16)27-22/h3-10,12-13,18-19H,11,14H2,1-2H3/t18-,19+/m1/s1
Reactome pathway
US Patent
0.0300 -14.3n/an/an/an/an/an/a25
Merck Sharp & Dohme Corp.
US Patent
Assay Description
The fluorescence polarization assay for cyclic nucleotide phosphodiesterases was performed using an IMAP FP kit supplied by Molecular Devices, Sunnyv...
US Patent US9273033 (2016)
BindingDB Entry DOI: 10.7270/Q26Q1W2R