BDBM209855 US9273052, 3::US9566277, 3
SMILES: COC(=O)c1nc(n2CCN(Cc12)C(=O)c1cc(Cc2n[nH]c(=O)c3ccccc23)ccc1F)C(F)(F)F
InChI Key: InChIKey=HIIJWJUIQSSMSB-UHFFFAOYSA-N
Data: 2 IC50
Activity Spreadsheet -- Enzyme Inhibition Constant Data from BindingDB
Found 2 hits for monomerid = 209855
Trg + Lig
Ki
nM
ΔG°
kcal/mole
IC50
nM
Kd
nM
EC50/IC50
nM
koff
s-1
kon
M-1s-1
pHTemp
°C
Poly [ADP-ribose] polymerase 1
(Homo sapiens (Human))
BDBM209855
(US9273052, 3 | US9566277, 3)
Show SMILES COC(=O)c1nc(n2CCN(Cc12)C(=O)c1cc(Cc2n[nH]c(=O)c3ccccc23)ccc1F)C(F)(F)F
Show InChI InChI=1S/C25H19F4N5O4/c1-38-23(37)20-19-12-33(8-9-34(19)24(30-20)25(27,28)29)22(36)16-10-13(6-7-17(16)26)11-18-14-4-2-3-5-15(14)21(35)32-31-18/h2-7,10H,8-9,11-12H2,1H3,(H,32,35)
US Patent
n/an/a 52n/an/an/an/an/a25
Jiangsu Hansoh Pharmaceutical Co., Ltd.
US Patent
Assay Description
he assay described below is to determine the activity of the compounds of the present invention for inhibiting the enzyme activity of PARP by using t...
US Patent US9566277 (2017)
BindingDB Entry DOI: 10.7270/Q2Q24279
Poly [ADP-ribose] polymerase 1
(Homo sapiens (Human))
BDBM209855
(US9273052, 3 | US9566277, 3)
Show SMILES COC(=O)c1nc(n2CCN(Cc12)C(=O)c1cc(Cc2n[nH]c(=O)c3ccccc23)ccc1F)C(F)(F)F
Show InChI InChI=1S/C25H19F4N5O4/c1-38-23(37)20-19-12-33(8-9-34(19)24(30-20)25(27,28)29)22(36)16-10-13(6-7-17(16)26)11-18-14-4-2-3-5-15(14)21(35)32-31-18/h2-7,10H,8-9,11-12H2,1H3,(H,32,35)
US Patent
n/an/a 52n/an/an/an/an/a25
Jiangsu Hansoh Pharmaceutical Co., Ltd.
US Patent
Assay Description
The tested compounds were dissolved in dimethylsulfoxide and then diluted with 1x buffer to the concentration desired in the experiment. 25 uL of a 2...
US Patent US9273052 (2016)
BindingDB Entry DOI: 10.7270/Q2Z60MWG