BDBM20986 4-{8-[butyl(ethyl)amino]-6-methyl-1H,2H,3H,4H-pyrido[2,3-b]pyrazin-4-yl}-3-methylbenzonitrile::Pyridopyrazine, 4b
SMILES: CCCCN(CC)c1cc(C)nc2N(CCNc12)c1ccc(cc1C)C#N
InChI Key: InChIKey=RUUCWHURNIHOLR-UHFFFAOYSA-N
Data: 1 IC50
Activity Spreadsheet -- Enzyme Inhibition Constant Data from BindingDB
Found 1 hit for monomerid = 20986
Trg + Lig
Ki
nM
ΔG°
kcal/mole
IC50
nM
Kd
nM
EC50/IC50
nM
koff
s-1
kon
M-1s-1
pHTemp
°C
Corticotropin-releasing factor receptor 1
(Rattus norvegicus (rat))
BDBM20986
(4-{8-[butyl(ethyl)amino]-6-methyl-1H,2H,3H,4H-pyri...)
Show SMILES CCCCN(CC)c1cc(C)nc2N(CCNc12)c1ccc(cc1C)C#N
Show InChI InChI=1S/C22H29N5/c1-5-7-11-26(6-2)20-14-17(4)25-22-21(20)24-10-12-27(22)19-9-8-18(15-23)13-16(19)3/h8-9,13-14,24H,5-7,10-12H2,1-4H3
Reactome pathway
n/an/a 3.5n/an/an/an/a7.023
Bristol-Myers Squibb Company
Assay Description
The IC50 values were measured by monitoring the inhibition effects of test compounds on [125I]-o-CRF binding to rat cortex in vitro.
J Med Chem 50: 2269-72 (2007)
Article DOI: 10.1021/jm0611410
BindingDB Entry DOI: 10.7270/Q25Q4TCS