BDBM20995 (2R)-2-[(2R)-3-(benzylsulfanyl)-2-[1-(4-phenylphenyl)acetamido]propanamido]-5-[(diaminomethylidene)amino]-N-[(1S)-2-(4-hydroxyphenyl)-1-[(2-phenylethyl)carbamoyl]ethyl]pentanamide::Tripeptide derivative, 2
SMILES: [#7]\[#6](-[#7])=[#7]/[#6]-[#6]-[#6]-[#6@@H](-[#7]-[#6](=O)-[#6@H](-[#6]-[#16]-[#6]-c1ccccc1)-[#7]-[#6](=O)-[#6]-c1ccc(cc1)-c1ccccc1)-[#6](=O)-[#7]-[#6@@H](-[#6]-c1ccc(-[#8])cc1)-[#6](=O)-[#7]-[#6]-[#6]-c1ccccc1
InChI Key: InChIKey=SEGBBQOGKYETCG-IWSHAHEXSA-N
Data: 1 KI
PDB links: 1 PDB ID matches this monomer.
Activity Spreadsheet -- Enzyme Inhibition Constant Data from BindingDB
Found 1 hit for monomerid = 20995
Trg + Lig
Ki
nM
ΔG°
kcal/mole
IC50
nM
Kd
nM
EC50/IC50
nM
koff
s-1
kon
M-1s-1
pHTemp
°C
Procathepsin L
(Homo sapiens (Human))
BDBM20995
((2R)-2-[(2R)-3-(benzylsulfanyl)-2-[1-(4-phenylphen...)
Show SMILES [#7]\[#6](-[#7])=[#7]/[#6]-[#6]-[#6]-[#6@@H](-[#7]-[#6](=O)-[#6@H](-[#6]-[#16]-[#6]-c1ccccc1)-[#7]-[#6](=O)-[#6]-c1ccc(cc1)-c1ccccc1)-[#6](=O)-[#7]-[#6@@H](-[#6]-c1ccc(-[#8])cc1)-[#6](=O)-[#7]-[#6]-[#6]-c1ccccc1 |r|
Show InChI InChI=1S/C47H53N7O5S/c48-47(49)51-27-10-17-40(45(58)54-41(29-34-20-24-39(55)25-21-34)44(57)50-28-26-33-11-4-1-5-12-33)53-46(59)42(32-60-31-36-13-6-2-7-14-36)52-43(56)30-35-18-22-38(23-19-35)37-15-8-3-9-16-37/h1-9,11-16,18-25,40-42,55H,10,17,26-32H2,(H,50,57)(H,52,56)(H,53,59)(H,54,58)(H4,48,49,51)/t40-,41+,42+/m1/s1
Reactome pathway
155 -9.28n/an/an/an/an/a5.525
National Research Council Canada
Assay Description
Fluorescence was monitored on a SPEX Fluorolog-2 spectrofluorometer with the excitation and emission wavelengths set at 380 and 440 nm, respectively....
J Med Chem 51: 1361-8 (2008)
Article DOI: 10.1021/jm701190v
BindingDB Entry DOI: 10.7270/Q21Z42QB
3D
3D Structure (crystal)