BDBM21002 (2R)-5-[(diaminomethylidene)amino]-N-[(1S)-2-(4-hydroxyphenyl)-1-[(2-phenylethyl)carbamoyl]ethyl]-2-[(2S)-2-[1-(4-phenylphenyl)acetamido]butanamido]pentanamide::Tripeptide derivative, 10
SMILES: [#6]-[#6]-[#6@H](-[#7]-[#6](=O)-[#6]-c1ccc(cc1)-c1ccccc1)-[#6](=O)-[#7]-[#6@H](-[#6]-[#6]-[#6]\[#7]=[#6](/[#7])-[#7])-[#6](=O)-[#7]-[#6@@H](-[#6]-c1ccc(-[#8])cc1)-[#6](=O)-[#7]-[#6]-[#6]-c1ccccc1
InChI Key: InChIKey=XKBIGLITSHIYJL-PDHQKIGBSA-N
Data: 1 KI
Activity Spreadsheet -- Enzyme Inhibition Constant Data from BindingDB
Found 1 hit for monomerid = 21002
Trg + Lig
Ki
nM
ΔG°
kcal/mole
IC50
nM
Kd
nM
EC50/IC50
nM
koff
s-1
kon
M-1s-1
pHTemp
°C
Procathepsin L
(Homo sapiens (Human))
BDBM21002
((2R)-5-[(diaminomethylidene)amino]-N-[(1S)-2-(4-hy...)
Show SMILES [#6]-[#6]-[#6@H](-[#7]-[#6](=O)-[#6]-c1ccc(cc1)-c1ccccc1)-[#6](=O)-[#7]-[#6@H](-[#6]-[#6]-[#6]\[#7]=[#6](/[#7])-[#7])-[#6](=O)-[#7]-[#6@@H](-[#6]-c1ccc(-[#8])cc1)-[#6](=O)-[#7]-[#6]-[#6]-c1ccccc1 |r|
Show InChI InChI=1S/C41H49N7O5/c1-2-34(46-37(50)27-30-15-19-32(20-16-30)31-12-7-4-8-13-31)39(52)47-35(14-9-24-45-41(42)43)40(53)48-36(26-29-17-21-33(49)22-18-29)38(51)44-25-23-28-10-5-3-6-11-28/h3-8,10-13,15-22,34-36,49H,2,9,14,23-27H2,1H3,(H,44,51)(H,46,50)(H,47,52)(H,48,53)(H4,42,43,45)/t34-,35+,36-/m0/s1
Reactome pathway
6.00E+3 -7.12n/an/an/an/an/a5.525
National Research Council Canada
Assay Description
Fluorescence was monitored on a SPEX Fluorolog-2 spectrofluorometer with the excitation and emission wavelengths set at 380 and 440 nm, respectively....
J Med Chem 51: 1361-8 (2008)
Article DOI: 10.1021/jm701190v
BindingDB Entry DOI: 10.7270/Q21Z42QB