BDBM21004 (3S)-3-{[(1R)-4-[(diaminomethylidene)amino]-1-{[(1S)-2-(4-hydroxyphenyl)-1-[(2-phenylethyl)carbamoyl]ethyl]carbamoyl}butyl]carbamoyl}-3-[1-(4-phenylphenyl)acetamido]propanoate::Tripeptide derivative, 12
SMILES: [#7]\[#6](-[#7])=[#7]/[#6]-[#6]-[#6]-[#6@@H](-[#7]-[#6](=O)-[#6@H](-[#6]-[#6](-[#8-])=O)-[#7]-[#6](=O)-[#6]-c1ccc(cc1)-c1ccccc1)-[#6](=O)-[#7]-[#6@@H](-[#6]-c1ccc(-[#8])cc1)-[#6](=O)-[#7]-[#6]-[#6]-c1ccccc1
InChI Key: InChIKey=ATDXCVYNOWLYJR-PLJDCMBSSA-M
Data: 1 KI
Activity Spreadsheet -- Enzyme Inhibition Constant Data from BindingDB
Found 1 hit for monomerid = 21004
Trg + Lig
Ki
nM
ΔG°
kcal/mole
IC50
nM
Kd
nM
EC50/IC50
nM
koff
s-1
kon
M-1s-1
pHTemp
°C
Procathepsin L
(Homo sapiens (Human))
BDBM21004
((3S)-3-{[(1R)-4-[(diaminomethylidene)amino]-1-{[(1...)
Show SMILES [#7]\[#6](-[#7])=[#7]/[#6]-[#6]-[#6]-[#6@@H](-[#7]-[#6](=O)-[#6@H](-[#6]-[#6](-[#8-])=O)-[#7]-[#6](=O)-[#6]-c1ccc(cc1)-c1ccccc1)-[#6](=O)-[#7]-[#6@@H](-[#6]-c1ccc(-[#8])cc1)-[#6](=O)-[#7]-[#6]-[#6]-c1ccccc1 |r|
Show InChI InChI=1S/C41H47N7O7/c42-41(43)45-22-7-12-33(39(54)48-34(24-28-15-19-32(49)20-16-28)38(53)44-23-21-27-8-3-1-4-9-27)47-40(55)35(26-37(51)52)46-36(50)25-29-13-17-31(18-14-29)30-10-5-2-6-11-30/h1-6,8-11,13-20,33-35,49H,7,12,21-26H2,(H,44,53)(H,46,50)(H,47,55)(H,48,54)(H,51,52)(H4,42,43,45)/p-1/t33-,34+,35+/m1/s1
Reactome pathway
5.75E+4 -5.78n/an/an/an/an/a5.525
National Research Council Canada
Assay Description
Fluorescence was monitored on a SPEX Fluorolog-2 spectrofluorometer with the excitation and emission wavelengths set at 380 and 440 nm, respectively....
J Med Chem 51: 1361-8 (2008)
Article DOI: 10.1021/jm701190v
BindingDB Entry DOI: 10.7270/Q21Z42QB