null
SMILES: Cc1cc2[nH]c(nc2cc1F)C1[C@@H]2Oc3ccc(Oc4ccnc5NC(=O)CCc45)cc3[C@H]12
InChI Key:
Activity Spreadsheet -- Enzyme Inhibition Constant Data from BindingDB
Found 2 hits for monomerid = 210045
Trg + Lig
Ki
nM
ΔG°
kcal/mole
IC50
nM
Kd
nM
EC50/IC50
nM
koff
s-1
kon
M-1s-1
pHTemp
°C
RAF proto-oncogene serine/threonine-protein kinase
(Homo sapiens (Human))
BDBM210045
(US9273046, 2.4a)
Show SMILES Cc1cc2[nH]c(nc2cc1F)C1[C@@H]2Oc3ccc(Oc4ccnc5NC(=O)CCc45)cc3[C@H]12 |r|
NCI pathway
Reactome pathway
US Patent
n/an/a 0.540n/an/an/an/an/a25
BeiGene, LTD.
US Patent
Assay Description
Compounds disclosed herein were tested against B-Raf (V600E) (PV3849, from Invitrogen) or C-Raf (Y340D/Y341D) (PV3805, from Invitrogen) in a time-res...
US Patent US9273046 (2016)
BindingDB Entry DOI: 10.7270/Q28G8JK6
Serine/threonine-protein kinase B-raf
(Homo sapiens (Human))
BDBM210045
(US9273046, 2.4a)
Show SMILES Cc1cc2[nH]c(nc2cc1F)C1[C@@H]2Oc3ccc(Oc4ccnc5NC(=O)CCc45)cc3[C@H]12 |r|
NCI pathway
Reactome pathway
US Patent
n/an/a 3.40n/an/an/an/an/a25
BeiGene, LTD.
US Patent
Assay Description
Compounds disclosed herein were tested against B-Raf (V600E) (PV3849, from Invitrogen) or C-Raf (Y340D/Y341D) (PV3805, from Invitrogen) in a time-res...
US Patent US9273046 (2016)
BindingDB Entry DOI: 10.7270/Q28G8JK6