null
SMILES: FC1(F)CN(C1)c1ccc(nc1OCC1CC1)C(=O)NNC1CCS(=O)(=O)C1
InChI Key: InChIKey=RVKKCBQGKSPZQN-UHFFFAOYSA-N
Activity Spreadsheet -- Enzyme Inhibition Constant Data from BindingDB
Found 2 hits for monomerid = 210602
Trg + Lig
Ki
nM
ΔG°
kcal/mole
IC50
nM
Kd
nM
EC50/IC50
nM
koff
s-1
kon
M-1s-1
pHTemp
°C
Cannabinoid receptor 1
(Homo sapiens (Human))
BDBM210602
(US9290451, 293)
Show SMILES FC1(F)CN(C1)c1ccc(nc1OCC1CC1)C(=O)NNC1CCS(=O)(=O)C1
Show InChI InChI=1S/C17H22F2N4O4S/c18-17(19)9-23(10-17)14-4-3-13(20-16(14)27-7-11-1-2-11)15(24)22-21-12-5-6-28(25,26)8-12/h3-4,11-12,21H,1-2,5-10H2,(H,22,24)
NCI pathway
Reactome pathway
US Patent
n/an/an/an/a>1.00E+4n/an/an/a37
Hoffmann-La Roche Inc.
US Patent
Assay Description
CHO cells expressing human CB1 or CB2 receptors are seeded 17-24 hours prior to the experiment 50.000 cells per well in a black 96 well plate with fl...
US Patent US9290451 (2016)
BindingDB Entry DOI: 10.7270/Q20Z724J
Cannabinoid receptor 2
(Homo sapiens (Human))
BDBM210602
(US9290451, 293)
Show SMILES FC1(F)CN(C1)c1ccc(nc1OCC1CC1)C(=O)NNC1CCS(=O)(=O)C1
Show InChI InChI=1S/C17H22F2N4O4S/c18-17(19)9-23(10-17)14-4-3-13(20-16(14)27-7-11-1-2-11)15(24)22-21-12-5-6-28(25,26)8-12/h3-4,11-12,21H,1-2,5-10H2,(H,22,24)
Reactome pathway
US Patent
n/an/an/an/a 791n/an/an/a37
Hoffmann-La Roche Inc.
US Patent
Assay Description
CHO cells expressing human CB1 or CB2 receptors are seeded 17-24 hours prior to the experiment 50.000 cells per well in a black 96 well plate with fl...
US Patent US9290451 (2016)
BindingDB Entry DOI: 10.7270/Q20Z724J