BDBM210636 US9290451, 313
SMILES: CCC(CC)(NC(=O)c1ccc(C2CC2)c(O[C@H](CCO)C(F)(F)F)n1)C(=O)NC
InChI Key: InChIKey=ZILQQLPCOPQXBI-OAHLLOKOSA-N
Data: 2 EC50
Activity Spreadsheet -- Enzyme Inhibition Constant Data from BindingDB
Found 2 hits for monomerid = 210636
Trg + Lig
Ki
nM
ΔG°
kcal/mole
IC50
nM
Kd
nM
EC50/IC50
nM
koff
s-1
kon
M-1s-1
pHTemp
°C
Cannabinoid receptor 1
(Homo sapiens (Human))
BDBM210636
(US9290451, 313)
Show SMILES CCC(CC)(NC(=O)c1ccc(C2CC2)c(O[C@H](CCO)C(F)(F)F)n1)C(=O)NC |r|
Show InChI InChI=1S/C20H28F3N3O4/c1-4-19(5-2,18(29)24-3)26-16(28)14-9-8-13(12-6-7-12)17(25-14)30-15(10-11-27)20(21,22)23/h8-9,12,15,27H,4-7,10-11H2,1-3H3,(H,24,29)(H,26,28)/t15-/m1/s1
NCI pathway
Reactome pathway
US Patent
n/an/an/an/a>1.00E+4n/an/an/a37
Hoffmann-La Roche Inc.
US Patent
Assay Description
CHO cells expressing human CB1 or CB2 receptors are seeded 17-24 hours prior to the experiment 50.000 cells per well in a black 96 well plate with fl...
US Patent US9290451 (2016)
BindingDB Entry DOI: 10.7270/Q20Z724J
Cannabinoid receptor 2
(Homo sapiens (Human))
BDBM210636
(US9290451, 313)
Show SMILES CCC(CC)(NC(=O)c1ccc(C2CC2)c(O[C@H](CCO)C(F)(F)F)n1)C(=O)NC |r|
Show InChI InChI=1S/C20H28F3N3O4/c1-4-19(5-2,18(29)24-3)26-16(28)14-9-8-13(12-6-7-12)17(25-14)30-15(10-11-27)20(21,22)23/h8-9,12,15,27H,4-7,10-11H2,1-3H3,(H,24,29)(H,26,28)/t15-/m1/s1
Reactome pathway
US Patent
n/an/an/an/a 981n/an/an/a37
Hoffmann-La Roche Inc.
US Patent
Assay Description
CHO cells expressing human CB1 or CB2 receptors are seeded 17-24 hours prior to the experiment 50.000 cells per well in a black 96 well plate with fl...
US Patent US9290451 (2016)
BindingDB Entry DOI: 10.7270/Q20Z724J